{"text_format":"1","workbook":"xlsx","n_sheets":5,"sheets":["Version","SAP-SP_NP","SAP-SP_NP-assign","Non-prismatic","Sheet1"],"not_rendered":{"charts":0,"images":1,"macros":1,"external_links":5,"defined_names":23,"comments":1,"pivot_tables":0},"unopened":[],"bounds":{"document_bytes":16777216,"sheet_cells":100000,"rows_first":2000,"rows_last":500,"rows_between":2000,"halvings":0,"cell_chars":16384,"cell_head_chars":4096},"cells_cut":0,"cells_raw":0,"read":"whole","date_system":"1900"}

{"sheet":"Version","index":0,"n_rows":33,"n_cols":27,"rows_kept":33,"cut":false,"hidden":true,"merged":[[6,0,6,26],[12,4,12,25]]}
[]
[]
[]
[]
[]
[]
["Version"]
[]
[null,"Name","SAP Non-Prismatic Generator"]
[null,"Version","01.02.04"]
{"$rows_left_out":24}
{"sheet":"SAP-SP_NP","index":1,"n_rows":52,"n_cols":34,"rows_kept":52,"cut":false,"hidden":false,"merged":[[24,20,25,28],[28,20,29,28],[1,31,1,32],[2,31,2,32],[26,20,27,28],[23,20,23,28],[14,20,14,28],[15,20,15,28],[20,20,21,28],[16,20,16,28],[19,20,19,28],[2,5,2,6],[3,5,3,6],[1,15,1,16],[2,15,2,16],[6,0,6,17],[3,15,3,16],[4,15,4,16]]}
[]
[null,null,null,null,null,null,null,null,null,null,null,null,null,null,"Project No:","XXX",null,null,null,null,null,null,null,null,null,null,null,null,null,null,null,"dbUNITS:",null,{"$f":"VLOOKUP('Non-prismatic'!AB2,'Non-prismatic'!$AE$2:$AF$20,2,FALSE)","v":"kip_ft_F"}]
[null,null,null,null,"Steel Material:","A992Fy50",null,null,null,null,null,null,null,null,"Project Name:","XXX",null,null,null,null,null,null,null,null,null,null,null,null,null,null,null,"presentUNITS",null,{"$f":"VLOOKUP('Non-prismatic'!AB3,'Non-prismatic'!$AE$2:$AF$20,2,FALSE)","v":"lb_in_F"}]
[null,null,null,null,"Criteria:","Capacity (Non-OSHPD)",null,null,null,null,null,null,null,null,"Date:",{"$f":"TODAY()","v":"2021-05-04"}]
[null,null,null,null,null,null,null,null,null,null,null,null,null,null,"Reviewed by:","XX"]
[]
["SAP2000 Non-Prismatic SidePlate Section Generator"]
[]
[]
[null,"Section","SP length (in)","Area","Shear A2","Shear A3","Ixx","Iyy","Sxx","Syy","rx","ry","Zx","Zy","Tor.","Bf","SP depth"]
{"$rows_left_out":43}
{"sheet":"SAP-SP_NP-assign","index":2,"n_rows":21,"n_cols":10,"rows_kept":21,"cut":false,"hidden":true,"merged":[[20,4,20,11],[6,0,6,11],[3,9,3,10],[1,9,1,10],[2,9,2,10],[4,9,4,10],[14,4,14,11],[15,4,15,11],[16,4,16,11],[17,4,17,11],[18,4,19,11]]}
[]
[null,null,null,null,null,null,null,null,"Project No:","XXX"]
[null,null,null,null,null,null,null,null,"Project Name:","XXX"]
[null,null,null,null,null,null,null,null,"Date:",{"$f":"TODAY()","v":"2021-05-04"}]
[null,null,null,null,null,null,null,null,"Reviewed by:","XX"]
[]
["SAP2000 Assign Section by Group"]
[]
[]
[null,"Group to be replaced","New Section",null,"Notes"]
{"$rows_left_out":12}
{"sheet":"Non-prismatic","index":3,"n_rows":274,"n_cols":32,"rows_kept":274,"cut":false,"hidden":true,"merged":[]}
[null,"Size",null,"SP depth","SP length",null,"Area","Shear A2","Shear A3","Ixx","Iyy",null,"Sxx","Syy","rx","ry","Zx","Zy","Tor.","Tor.",null,"Bf",null,null,null,null,"Materials","Units"]
[null,"W44X335",null,48,34,null,98.5,45.32,56.286000000000001,31100,1200,null,1410,150,17.8,3.49,1620,236,100,74.7,null,16,null,null,null,null,null,4,null,null,1,"lb_in_F"]
[null,"W44X290",null,47,34,null,85.4,37.714000000000006,49.928000000000004,27000,1040,null,1240,132,17.8,3.49,1410,205,100,50.9,null,15.875,null,null,null,null,"A992Fy50",1,null,null,2,"lb_ft_F"]
[null,"W44X262",null,47,33,null,77.2,33.990499999999997,44.872000000000007,24100,923,null,1110,117,17.7,3.47,1270,182,100,37.299999999999997,null,15.75,null,null,null,null,"4000Psi",null,null,null,3,"kip_in_F"]
[null,"W44X230",null,47,33,null,67.8,30.458999999999993,38.552,20800,796,null,971,101,17.5,3.43,1100,157,100,24.9,null,15.75,null,null,null,null,null,null,null,null,4,"kip_ft_F"]
[null,"W40X593",null,46,31,null,174,76.97,107.88199999999999,50400,2520,null,2340,302,17,3.7999999999999994,2760,481,100,445,null,16.75,null,null,null,null,null,null,null,null,5,"kN_mm_C"]
[null,"W40X503",null,46,31,null,148,64.834000000000003,90.527999999999977,41600,2040,null,1980,249,16.8,3.72,2320,394,100,277,null,16.375,null,null,null,null,null,null,null,null,6,"kN_m_C"]
[null,"W40X431",null,46,31,null,127,55.342000000000006,76.463999999999984,34800,1690,null,1690,208,16.600000000000001,3.65,1960,328,100,177,null,16.25,null,null,null,null,null,null,null,null,7,"kgf_mm_C"]
[null,"W40X397",null,46,31,null,117,50.02,70.840000000000018,32000,1540,null,1560,191,16.600000000000001,3.64,1800,300,100,142,null,16.125,null,null,null,null,null,null,null,null,8,"kgf_m_C"]
[null,"W40X372",null,44.6,31,null,110,47.096000000000004,66.010000000000005,29600,1420,null,1460,177,16.5,3.6,1680,277,100,116,null,16.125,null,null,null,null,null,null,null,null,9,"N_mm_C"]
{"$rows_left_out":265}
{"sheet":"Sheet1","index":4,"n_rows":15,"n_cols":14,"rows_kept":15,"cut":false,"hidden":true,"merged":[]}
[]
[]
[]
[]
[]
[null,"Multiplication factor for NPSP beams"]
[null,null,"Area","Shear A2","Shear A3","Ixx","Iyy","Sxx","Syy","rx","ry","Zx","Zy","Tor."]
[null,"Capacity (Non-OSHPD)",3,3,3,3,3,3,3,3,3,3,3,1]
[null,"Capacity (OSHPD)",1,1,1,3,1,"see below",1,1,1,"see below",1,1]
[null,"R=3",1,1,1,1,1,3,3,1,1,3,3,1]
{"$rows_left_out":5}