{"text_format":"1","workbook":"xlsx","n_sheets":9,"sheets":["Version","ETABS-NPSP Generator","ETABS-SP_NP-assign","ETABS-NPSP Converter","Non-prismatic","Multipliers","SP Plus Bolted","SP Bolted","SP Welded"],"not_rendered":{"charts":0,"images":2,"macros":1,"external_links":1,"defined_names":16,"comments":0,"pivot_tables":0},"unopened":[],"bounds":{"document_bytes":16777216,"sheet_cells":100000,"rows_first":2000,"rows_last":500,"rows_between":2000,"halvings":0,"cell_chars":16384,"cell_head_chars":4096},"cells_cut":0,"cells_raw":0,"read":"whole","date_system":"1900"}

{"sheet":"Version","index":0,"n_rows":47,"n_cols":27,"rows_kept":47,"cut":false,"hidden":true,"merged":[[6,0,6,26],[12,4,12,25]]}
[]
[]
[]
[]
[]
[]
["Version"]
[]
[null,"Name","ETABS Non-Prismatic Generator"]
[null,"Version","03.03.02"]
[null,"Owner","RW"]
[]
[null,"Version","Date","#","Description"]
["Insert ->",null,null,null,null,null,null,null,null,null,null,null,null,null,null,null,null,null,null,null,null,null,null,null,null,null,"<-Insert"]
[null,"03.03.02","2021-05-04",null,"Minor revision for new logo and color scheme"]
[null,null,null,1,null,"Logos and colors are updated"]
[null,"03.03.01","2020-12-07",null,"Minor Revision for new version of ETABS"]
[null,null,null,1,null,"Modified previous reference for ETABS 17 & 18 to be ETABS 19"]
[null,"03.02.01","2020-01-15",null,"Minor Revision for marketing initiative and updted connection properties"]
[null,null,null,1,null,"Implement new SidePlate logos on each tab"]
{"$rows_left_out":28}
{"sheet":"ETABS-NPSP Generator","index":1,"n_rows":50,"n_cols":13,"rows_kept":50,"cut":false,"hidden":false,"merged":[[3,6,4,8],[19,12,19,20],[20,12,21,20],[22,12,23,20],[28,12,29,20],[30,12,31,20],[6,0,6,9],[26,12,26,20],[18,12,18,20],[6,11,6,21],[27,12,27,20]]}
[]
[]
[null,null,null,null,null,null,"SidePlate Connection Type:","SidePlate Plus Bolted"]
[null,null,null,null,null,null,{"$f":"IF(Connection_Criteria= \"\",\"Please select a SidePlate Connection Type above\",VLOOKUP(Connection_Criteria,'Non-prismatic'!$M$3:$N$5,2,FALSE))","v":"SidePlate Plus Bolted Connections are applicable for Special Moment Frames, Intermediate Moment Frames, and Ordinary Moment Frames."}]
[]
[]
["ETABS Non-Prismatic SidePlate Section Generator",null,null,null,null,null,null,null,null,null,null,"Instructions"]
[]
[null,null,null,null,null,null,null,null,null,null,null,null,"Use this sheet to generate Non-Prismatic SidePlate frame sections and load them"]
[null,"Section","SP Length Override (in)","SP Depth Override (in)","SP Length (in)","SP Depth (in)","Section Name","SidePlate Section Name","Non-Prismatic \nSection Name",null,null,null,"into your ETABS model as SidePlate Beams for use in your analysis and design."]
[null,"W21X62",null,null,{"$f":"IF(B11=\"\",\"\",IFERROR(IF(C11<>\"\",C11,VLOOKUP($B11,'Non-prismatic'!$A$3:$C$486,2,FALSE)),\"\"))","v":18},{"$f":"IF(B11=\"\",\"\",IFERROR(IF(D11<>\"\",D11,VLOOKUP($B11,'Non-prismatic'!$A$3:$C$486,3,FALSE)),\"\"))","v":24.5},{"$f":"IF(B11=\"\",\"\",IF(COUNTIF('Non-prismatic'!$A$3:$A$486,B11)>0,UPPER(B11),\"Not Found\"))","v":"W21X62"},{"$f":"IF(B11=\"\",\"\",IF(OR(E11=\"\",F11=\"\"),\"No Data Available\",G11&\"SP\"))","v":"W21X62SP"},{"$f":"IF(B11=\"\",\"\",IF(OR(E11=\"\",F11=\"\"),\"No Data Available\",G11&\"NPSP\"&IF(C11=\"\",\"\",\"(DimA=\"&ROUND(C11,0)&\")\")&IF(D11=\"\",\"\",\"(DimB=\"&ROUND(D11,1)&\")\")))","v":"W21X62NPSP"},null,null,null,"User Notes"]
[null,"W24x76",null,null,{"$f":"IF(B12=\"\",\"\",IFERROR(IF(C12<>\"\",C12,VLOOKUP($B12,'Non-prismatic'!$A$3:$C$486,2,FALSE)),\"\"))","v":21},{"$f":"IF(B12=\"\",\"\",IFERROR(IF(D12<>\"\",D12,VLOOKUP($B12,'Non-prismatic'!$A$3:$C$486,3,FALSE)),\"\"))","v":27.5},{"$f":"IF(B12=\"\",\"\",IF(COUNTIF('Non-prismatic'!$A$3:$A$486,B12)>0,UPPER(B12),\"Not Found\"))","v":"W24X76"},"W24X76SP",{"$f":"IF(B12=\"\",\"\",IF(OR(E12=\"\",F12=\"\"),\"No Data Available\",G12&\"NPSP\"&IF(C12=\"\",\"\",\"(DimA=\"&ROUND(C12,0)&\")\")&IF(D12=\"\",\"\",\"(DimB=\"&ROUND(D12,1)&\")\")))","v":"W24X76NPSP"},null,null,null,"1. The ETABS model must be open and unlocked, valid for ETABS 19"]
[null,"W27x94",null,null,{"$f":"IF(B13=\"\",\"\",IFERROR(IF(C13<>\"\",C13,VLOOKUP($B13,'Non-prismatic'!$A$3:$C$486,2,FALSE)),\"\"))","v":23},{"$f":"IF(B13=\"\",\"\",IFERROR(IF(D13<>\"\",D13,VLOOKUP($B13,'Non-prismatic'!$A$3:$C$486,3,FALSE)),\"\"))","v":30.5},{"$f":"IF(B13=\"\",\"\",IF(COUNTIF('Non-prismatic'!$A$3:$A$486,B13)>0,UPPER(B13),\"Not Found\"))","v":"W27X94"},"W27X94SP",{"$f":"IF(B13=\"\",\"\",IF(OR(E13=\"\",F13=\"\"),\"No Data Available\",G13&\"NPSP\"&IF(C13=\"\",\"\",\"(DimA=\"&ROUND(C13,0)&\")\")&IF(D13=\"\",\"\",\"(DimB=\"&ROUND(D13,1)&\")\")))","v":"W27X94NPSP"},null,null,null,"2. You can only have 1 ETABS model open at the time you use this spreadsheet"]
[null,"W30x108",null,null,{"$f":"IF(B14=\"\",\"\",IFERROR(IF(C14<>\"\",C14,VLOOKUP($B14,'Non-prismatic'!$A$3:$C$486,2,FALSE)),\"\"))","v":26},{"$f":"IF(B14=\"\",\"\",IFERROR(IF(D14<>\"\",D14,VLOOKUP($B14,'Non-prismatic'!$A$3:$C$486,3,FALSE)),\"\"))","v":33.5},{"$f":"IF(B14=\"\",\"\",IF(COUNTIF('Non-prismatic'!$A$3:$A$486,B14)>0,UPPER(B14),\"Not Found\"))","v":"W30X108"},"W30X108SP","W30X108NPSP",null,null,null,"3. Spreadsheet cells with blue text and blue fill are editable"]
[null,"W33x130",null,null,{"$f":"IF(B15=\"\",\"\",IFERROR(IF(C15<>\"\",C15,VLOOKUP($B15,'Non-prismatic'!$A$3:$C$486,2,FALSE)),\"\"))","v":29},{"$f":"IF(B15=\"\",\"\",IFERROR(IF(D15<>\"\",D15,VLOOKUP($B15,'Non-prismatic'!$A$3:$C$486,3,FALSE)),\"\"))","v":37},{"$f":"IF(B15=\"\",\"\",IF(COUNTIF('Non-prismatic'!$A$3:$A$486,B15)>0,UPPER(B15),\"Not Found\"))","v":"W33X130"},"W33X130SP","W33X130NPSP",null,null,null,"4. Duplicate frame sections will only be imported into the ETABS model once"]
[null,"W36x150",null,null,{"$f":"IF(B16=\"\",\"\",IFERROR(IF(C16<>\"\",C16,VLOOKUP($B16,'Non-prismatic'!$A$3:$C$486,2,FALSE)),\"\"))","v":31},{"$f":"IF(B16=\"\",\"\",IFERROR(IF(D16<>\"\",D16,VLOOKUP($B16,'Non-prismatic'!$A$3:$C$486,3,FALSE)),\"\"))","v":39.5},{"$f":"IF(B16=\"\",\"\",IF(COUNTIF('Non-prismatic'!$A$3:$A$486,B16)>0,UPPER(B16),\"Not Found\"))","v":"W36X150"},"W36X150SP","W36X150NPSP",null,null,null,"5. Refer to the SidePlate website for other requirements for modeling SidePlate in ETABS"]
[null,null,null,null,{"$f":"IF(B17=\"\",\"\",IFERROR(IF(C17<>\"\",C17,VLOOKUP($B17,'Non-prismatic'!$A$3:$C$486,2,FALSE)),\"\"))","v":""},{"$f":"IF(B17=\"\",\"\",IFERROR(IF(D17<>\"\",D17,VLOOKUP($B17,'Non-prismatic'!$A$3:$C$486,3,FALSE)),\"\"))","v":""},{"$f":"IF(B17=\"\",\"\",IF(COUNTIF('Non-prismatic'!$A$3:$A$486,B17)>0,UPPER(B17),\"Not Found\"))","v":""},"",""]
[null,null,null,null,{"$f":"IF(B18=\"\",\"\",IFERROR(IF(C18<>\"\",C18,VLOOKUP($B18,'Non-prismatic'!$A$3:$C$486,2,FALSE)),\"\"))","v":""},{"$f":"IF(B18=\"\",\"\",IFERROR(IF(D18<>\"\",D18,VLOOKUP($B18,'Non-prismatic'!$A$3:$C$486,3,FALSE)),\"\"))","v":""},{"$f":"IF(B18=\"\",\"\",IF(COUNTIF('Non-prismatic'!$A$3:$A$486,B18)>0,UPPER(B18),\"Not Found\"))","v":""},"","",null,null,null,"Generating Non-Prismatic SidePlate  Sections"]
[null,null,null,null,{"$f":"IF(B19=\"\",\"\",IFERROR(IF(C19<>\"\",C19,VLOOKUP($B19,'Non-prismatic'!$A$3:$C$486,2,FALSE)),\"\"))","v":""},{"$f":"IF(B19=\"\",\"\",IFERROR(IF(D19<>\"\",D19,VLOOKUP($B19,'Non-prismatic'!$A$3:$C$486,3,FALSE)),\"\"))","v":""},{"$f":"IF(B19=\"\",\"\",IF(COUNTIF('Non-prismatic'!$A$3:$A$486,B19)>0,UPPER(B19),\"Not Found\"))","v":""},"","",null,null,null,"1. Open the ETABS model you wish to add Non-Prismatic SidePlate sections to."]
[null,null,null,null,{"$f":"IF(B20=\"\",\"\",IFERROR(IF(C20<>\"\",C20,VLOOKUP($B20,'Non-prismatic'!$A$3:$C$486,2,FALSE)),\"\"))","v":""},{"$f":"IF(B20=\"\",\"\",IFERROR(IF(D20<>\"\",D20,VLOOKUP($B20,'Non-prismatic'!$A$3:$C$486,3,FALSE)),\"\"))","v":""},{"$f":"IF(B20=\"\",\"\",IF(COUNTIF('Non-prismatic'!$A$3:$A$486,B20)>0,UPPER(B20),\"Not Found\"))","v":""},"","",null,null,null,"2. At the top of this sheet, use the drop down menu to select the SidePlate Connection Type."]
{"$rows_left_out":31}
{"sheet":"ETABS-SP_NP-assign","index":2,"n_rows":23,"n_cols":5,"rows_kept":23,"cut":false,"hidden":true,"merged":[[6,0,6,11],[20,4,21,10],[9,4,9,11]]}
[]
[]
[]
[]
[]
[]
["ETABS Assign Section by Group"]
[]
[]
[null,"Group to be replaced","New Section",null,"Instructions"]
[null,"Lateral Roof","W21X83NPSP"]
[null,"Lateral Level 03","W24X84NPSP",null,"Notes"]
[null,"Lateral Level 02","W27X94NPSP",null,"1. You must have your ETABS model opened"]
[null,null,null,null,"2. You can only have 1 ETABS model opened at the time you use this spreadsheet"]
[]
[null,null,null,null,"Instructions"]
[null,null,null,null,"1. Create groups for the sections that you want to replace: Define -> Group definitions"]
[null,null,null,null,"2. Assign beams to the groups created"]
[null,null,null,null,"3. Use column \"B\" to write the groups of beams that you want to change the section"]
[null,null,null,null,"4. Use column \"C\" to write the name of the new section. Ex: W36X170NPSP"]
{"$rows_left_out":4}
{"sheet":"ETABS-NPSP Converter","index":3,"n_rows":39,"n_cols":3,"rows_kept":39,"cut":false,"hidden":false,"merged":[[25,1,25,9],[26,1,26,9],[28,1,28,9],[8,2,8,3],[6,0,6,10],[10,2,10,3],[9,2,9,3],[12,0,12,10],[40,1,40,10],[29,1,29,9],[27,1,27,9],[34,1,34,9],[38,1,38,9],[32,1,32,9],[39,1,39,10]]}
[]
[]
[]
[]
[]
[]
["ETABS Non-Prismatic SidePlate Beam Converter"]
[]
[null,"Convert Beams from :","Standard to Non-Prismatic"]
[null,"Group to convert :"]
[null,"SidePlate Connection Type :","SidePlate Plus Bolted"]
[]
["Instructions"]
[]
[null,"Use this sheet to convert a whole group of members in your ETABS model from standard shapes "]
[null,"to Non-Prismatic SidePlate sections or vice-versa."]
[]
[null,"User Notes"]
[null,"1. The ETABS model must be open and unlocked, valid for ETABS 19"]
[null,"2. You can only have 1 ETABS model open at the time you use this spreadsheet"]
{"$rows_left_out":20}
{"sheet":"Non-prismatic","index":4,"n_rows":486,"n_cols":14,"rows_kept":486,"cut":false,"hidden":true,"merged":[[0,9,0,10]]}
["Shape","SP Length (in)","SP Depth (in)",null,"Groups",null,"Materials",null,"Selected Connection","Multipliers",null,null,"Connection Type"]
[]
[{"$f":"IF($I$3=$M$3,'SP Plus Bolted'!A2,IF($I$3=$M$4,'SP Bolted'!A2,IF($I$3=$M$5,'SP Welded'!A2,\"\")))","v":"W44X335"},{"$f":"IF($I$3=$M$3,'SP Plus Bolted'!B2,IF($I$3=$M$4,'SP Bolted'!B2,IF($I$3=$M$5,'SP Welded'!B2,\"\")))","v":38},{"$f":"IF($I$3=$M$3,'SP Plus Bolted'!C2,IF($I$3=$M$4,'SP Bolted'!C2,IF($I$3=$M$5,'SP Welded'!C2,\"\")))","v":47.5},null,null,null,"A992Fy50",null,{"$f":"'ETABS-NPSP Generator'!Connection_Criteria","v":"SidePlate Plus Bolted"},"Ix",{"$f":"VLOOKUP(I3,Multipliers!$B$22:$E$24,2,FALSE)","v":3},null,"SidePlate Plus Bolted","SidePlate Plus Bolted Connections are applicable for Special Moment Frames, Intermediate Moment Frames, and Ordinary Moment Frames."]
[{"$f":"IF($I$3=$M$3,'SP Plus Bolted'!A3,IF($I$3=$M$4,'SP Bolted'!A3,IF($I$3=$M$5,'SP Welded'!A3,\"\")))","v":"W44X290"},{"$f":"IF($I$3=$M$3,'SP Plus Bolted'!B3,IF($I$3=$M$4,'SP Bolted'!B3,IF($I$3=$M$5,'SP Welded'!B3,\"\")))","v":38},{"$f":"IF($I$3=$M$3,'SP Plus Bolted'!C3,IF($I$3=$M$4,'SP Bolted'!C3,IF($I$3=$M$5,'SP Welded'!C3,\"\")))","v":47.5},null,null,null,"4000Psi(NWC)",null,null,"Sx",{"$f":"VLOOKUP(I3,Multipliers!$B$22:$E$24,3,FALSE)","v":2.5},null,"SidePlate Bolted","SidePlate Bolted Connections are applicable for steel systems not specifically detailed for seismic resistance."]
[{"$f":"IF($I$3=$M$3,'SP Plus Bolted'!A4,IF($I$3=$M$4,'SP Bolted'!A4,IF($I$3=$M$5,'SP Welded'!A4,\"\")))","v":"W44X262"},{"$f":"IF($I$3=$M$3,'SP Plus Bolted'!B4,IF($I$3=$M$4,'SP Bolted'!B4,IF($I$3=$M$5,'SP Welded'!B4,\"\")))","v":37},{"$f":"IF($I$3=$M$3,'SP Plus Bolted'!C4,IF($I$3=$M$4,'SP Bolted'!C4,IF($I$3=$M$5,'SP Welded'!C4,\"\")))","v":47},null,null,null,"A615Gr60",null,null,"Zx",{"$f":"VLOOKUP(I3,Multipliers!$B$22:$E$24,4,FALSE)","v":2.5},null,"SidePlate Welded","SidePlate Welded connectiosn are applicable for Special Moment Frames."]
[{"$f":"IF($I$3=$M$3,'SP Plus Bolted'!A5,IF($I$3=$M$4,'SP Bolted'!A5,IF($I$3=$M$5,'SP Welded'!A5,\"\")))","v":"W44X230"},{"$f":"IF($I$3=$M$3,'SP Plus Bolted'!B5,IF($I$3=$M$4,'SP Bolted'!B5,IF($I$3=$M$5,'SP Welded'!B5,\"\")))","v":37},{"$f":"IF($I$3=$M$3,'SP Plus Bolted'!C5,IF($I$3=$M$4,'SP Bolted'!C5,IF($I$3=$M$5,'SP Welded'!C5,\"\")))","v":46.5},null,null,null,"A416Gr270"]
[{"$f":"IF($I$3=$M$3,'SP Plus Bolted'!A6,IF($I$3=$M$4,'SP Bolted'!A6,IF($I$3=$M$5,'SP Welded'!A6,\"\")))","v":"W40X655"},{"$f":"IF($I$3=$M$3,'SP Plus Bolted'!B6,IF($I$3=$M$4,'SP Bolted'!B6,IF($I$3=$M$5,'SP Welded'!B6,\"\")))","v":38},{"$f":"IF($I$3=$M$3,'SP Plus Bolted'!C6,IF($I$3=$M$4,'SP Bolted'!C6,IF($I$3=$M$5,'SP Welded'!C6,\"\")))","v":47.5},null,null,null,"4000psi(LWC)"]
[{"$f":"IF($I$3=$M$3,'SP Plus Bolted'!A7,IF($I$3=$M$4,'SP Bolted'!A7,IF($I$3=$M$5,'SP Welded'!A7,\"\")))","v":"W40X593"},{"$f":"IF($I$3=$M$3,'SP Plus Bolted'!B7,IF($I$3=$M$4,'SP Bolted'!B7,IF($I$3=$M$5,'SP Welded'!B7,\"\")))","v":37},{"$f":"IF($I$3=$M$3,'SP Plus Bolted'!C7,IF($I$3=$M$4,'SP Bolted'!C7,IF($I$3=$M$5,'SP Welded'!C7,\"\")))","v":46.5},null,null,null,"A500GrB46"]
[{"$f":"IF($I$3=$M$3,'SP Plus Bolted'!A8,IF($I$3=$M$4,'SP Bolted'!A8,IF($I$3=$M$5,'SP Welded'!A8,\"\")))","v":"W40X503"},{"$f":"IF($I$3=$M$3,'SP Plus Bolted'!B8,IF($I$3=$M$4,'SP Bolted'!B8,IF($I$3=$M$5,'SP Welded'!B8,\"\")))","v":36},{"$f":"IF($I$3=$M$3,'SP Plus Bolted'!C8,IF($I$3=$M$4,'SP Bolted'!C8,IF($I$3=$M$5,'SP Welded'!C8,\"\")))","v":45.5},null,null,null,"A913Gr65"]
[{"$f":"IF($I$3=$M$3,'SP Plus Bolted'!A9,IF($I$3=$M$4,'SP Bolted'!A9,IF($I$3=$M$5,'SP Welded'!A9,\"\")))","v":"W40X431"},{"$f":"IF($I$3=$M$3,'SP Plus Bolted'!B9,IF($I$3=$M$4,'SP Bolted'!B9,IF($I$3=$M$5,'SP Welded'!B9,\"\")))","v":36},{"$f":"IF($I$3=$M$3,'SP Plus Bolted'!C9,IF($I$3=$M$4,'SP Bolted'!C9,IF($I$3=$M$5,'SP Welded'!C9,\"\")))","v":45}]
[{"$f":"IF($I$3=$M$3,'SP Plus Bolted'!A10,IF($I$3=$M$4,'SP Bolted'!A10,IF($I$3=$M$5,'SP Welded'!A10,\"\")))","v":"W40X397"},{"$f":"IF($I$3=$M$3,'SP Plus Bolted'!B10,IF($I$3=$M$4,'SP Bolted'!B10,IF($I$3=$M$5,'SP Welded'!B10,\"\")))","v":35},{"$f":"IF($I$3=$M$3,'SP Plus Bolted'!C10,IF($I$3=$M$4,'SP Bolted'!C10,IF($I$3=$M$5,'SP Welded'!C10,\"\")))","v":44.5}]
[{"$f":"IF($I$3=$M$3,'SP Plus Bolted'!A11,IF($I$3=$M$4,'SP Bolted'!A11,IF($I$3=$M$5,'SP Welded'!A11,\"\")))","v":"W40X372"},{"$f":"IF($I$3=$M$3,'SP Plus Bolted'!B11,IF($I$3=$M$4,'SP Bolted'!B11,IF($I$3=$M$5,'SP Welded'!B11,\"\")))","v":35},{"$f":"IF($I$3=$M$3,'SP Plus Bolted'!C11,IF($I$3=$M$4,'SP Bolted'!C11,IF($I$3=$M$5,'SP Welded'!C11,\"\")))","v":44.5}]
[{"$f":"IF($I$3=$M$3,'SP Plus Bolted'!A12,IF($I$3=$M$4,'SP Bolted'!A12,IF($I$3=$M$5,'SP Welded'!A12,\"\")))","v":"W40X362"},{"$f":"IF($I$3=$M$3,'SP Plus Bolted'!B12,IF($I$3=$M$4,'SP Bolted'!B12,IF($I$3=$M$5,'SP Welded'!B12,\"\")))","v":35},{"$f":"IF($I$3=$M$3,'SP Plus Bolted'!C12,IF($I$3=$M$4,'SP Bolted'!C12,IF($I$3=$M$5,'SP Welded'!C12,\"\")))","v":44}]
[{"$f":"IF($I$3=$M$3,'SP Plus Bolted'!A13,IF($I$3=$M$4,'SP Bolted'!A13,IF($I$3=$M$5,'SP Welded'!A13,\"\")))","v":"W40X324"},{"$f":"IF($I$3=$M$3,'SP Plus Bolted'!B13,IF($I$3=$M$4,'SP Bolted'!B13,IF($I$3=$M$5,'SP Welded'!B13,\"\")))","v":35},{"$f":"IF($I$3=$M$3,'SP Plus Bolted'!C13,IF($I$3=$M$4,'SP Bolted'!C13,IF($I$3=$M$5,'SP Welded'!C13,\"\")))","v":44}]
[{"$f":"IF($I$3=$M$3,'SP Plus Bolted'!A14,IF($I$3=$M$4,'SP Bolted'!A14,IF($I$3=$M$5,'SP Welded'!A14,\"\")))","v":"W40X297"},{"$f":"IF($I$3=$M$3,'SP Plus Bolted'!B14,IF($I$3=$M$4,'SP Bolted'!B14,IF($I$3=$M$5,'SP Welded'!B14,\"\")))","v":34},{"$f":"IF($I$3=$M$3,'SP Plus Bolted'!C14,IF($I$3=$M$4,'SP Bolted'!C14,IF($I$3=$M$5,'SP Welded'!C14,\"\")))","v":43.5}]
[{"$f":"IF($I$3=$M$3,'SP Plus Bolted'!A15,IF($I$3=$M$4,'SP Bolted'!A15,IF($I$3=$M$5,'SP Welded'!A15,\"\")))","v":"W40X277"},{"$f":"IF($I$3=$M$3,'SP Plus Bolted'!B15,IF($I$3=$M$4,'SP Bolted'!B15,IF($I$3=$M$5,'SP Welded'!B15,\"\")))","v":34},{"$f":"IF($I$3=$M$3,'SP Plus Bolted'!C15,IF($I$3=$M$4,'SP Bolted'!C15,IF($I$3=$M$5,'SP Welded'!C15,\"\")))","v":43.5}]
[{"$f":"IF($I$3=$M$3,'SP Plus Bolted'!A16,IF($I$3=$M$4,'SP Bolted'!A16,IF($I$3=$M$5,'SP Welded'!A16,\"\")))","v":"W40X249"},{"$f":"IF($I$3=$M$3,'SP Plus Bolted'!B16,IF($I$3=$M$4,'SP Bolted'!B16,IF($I$3=$M$5,'SP Welded'!B16,\"\")))","v":34},{"$f":"IF($I$3=$M$3,'SP Plus Bolted'!C16,IF($I$3=$M$4,'SP Bolted'!C16,IF($I$3=$M$5,'SP Welded'!C16,\"\")))","v":43}]
[{"$f":"IF($I$3=$M$3,'SP Plus Bolted'!A17,IF($I$3=$M$4,'SP Bolted'!A17,IF($I$3=$M$5,'SP Welded'!A17,\"\")))","v":"W40X215"},{"$f":"IF($I$3=$M$3,'SP Plus Bolted'!B17,IF($I$3=$M$4,'SP Bolted'!B17,IF($I$3=$M$5,'SP Welded'!B17,\"\")))","v":34},{"$f":"IF($I$3=$M$3,'SP Plus Bolted'!C17,IF($I$3=$M$4,'SP Bolted'!C17,IF($I$3=$M$5,'SP Welded'!C17,\"\")))","v":42.5}]
[{"$f":"IF($I$3=$M$3,'SP Plus Bolted'!A18,IF($I$3=$M$4,'SP Bolted'!A18,IF($I$3=$M$5,'SP Welded'!A18,\"\")))","v":"W40X199"},{"$f":"IF($I$3=$M$3,'SP Plus Bolted'!B18,IF($I$3=$M$4,'SP Bolted'!B18,IF($I$3=$M$5,'SP Welded'!B18,\"\")))","v":33},{"$f":"IF($I$3=$M$3,'SP Plus Bolted'!C18,IF($I$3=$M$4,'SP Bolted'!C18,IF($I$3=$M$5,'SP Welded'!C18,\"\")))","v":42.5}]
[{"$f":"IF($I$3=$M$3,'SP Plus Bolted'!A19,IF($I$3=$M$4,'SP Bolted'!A19,IF($I$3=$M$5,'SP Welded'!A19,\"\")))","v":"W40X392"},{"$f":"IF($I$3=$M$3,'SP Plus Bolted'!B19,IF($I$3=$M$4,'SP Bolted'!B19,IF($I$3=$M$5,'SP Welded'!B19,\"\")))","v":36},{"$f":"IF($I$3=$M$3,'SP Plus Bolted'!C19,IF($I$3=$M$4,'SP Bolted'!C19,IF($I$3=$M$5,'SP Welded'!C19,\"\")))","v":45.5}]
{"$rows_left_out":467}
{"sheet":"Multipliers","index":5,"n_rows":24,"n_cols":14,"rows_kept":24,"cut":false,"hidden":true,"merged":[[19,2,19,4]]}
[]
[]
[]
[null,"OLD, 9/28/2019 - RW"]
[]
[null,"Multiplication factor for NPSP beams"]
[null,null,"Area","Shear A2","Shear A3","Ixx","Iyy","Sxx","Syy","rx","ry","Zx","Zy","Tor."]
[null,"Capacity (Non-OSHPD)",3,3,3,3,3,3,3,3,3,3,3,1]
[null,"Capacity (OSHPD)",1,1,1,3,1,"see below",1,1,1,"see below",1,1]
[null,"R=3",1,1,1,1,1,3,3,1,1,3,3,1]
[null,"Multiplication factor for NPSP beams"]
[null,null,"Area","Shear A2","Shear A3","Ixx","Iyy","Sxx","Syy","rx","ry","Zx","Zy","Tor."]
[null,"Capacity (Non-OSHPD)",3,3,3,3,3,3,3,3,3,3,3,1]
[null,"Capacity (OSHPD)",1,1,1,3,1,"2*(3*Ixx)/DimB",1,1,1,"1.15*Sxx",1,1]
[null,"R=3",1,1,1,1,1,3,3,1,1,3,3,1]
[]
[]
[null,"New, 9/28/2019"]
[]
[null,null,"Multipliers"]
{"$rows_left_out":5}
{"sheet":"SP Plus Bolted","index":6,"n_rows":485,"n_cols":3,"rows_kept":485,"cut":false,"hidden":true,"merged":[]}
["Shape","SP Length (in)","SP Depth (in)"]
["W44X335",38,47.5]
["W44X290",38,47.5]
["W44X262",37,47]
["W44X230",37,46.5]
["W40X655",38,47.5]
["W40X593",37,46.5]
["W40X503",36,45.5]
["W40X431",36,45]
["W40X397",35,44.5]
["W40X372",35,44.5]
["W40X362",35,44]
["W40X324",35,44]
["W40X297",34,43.5]
["W40X277",34,43.5]
["W40X249",34,43]
["W40X215",34,42.5]
["W40X199",33,42.5]
["W40X392",36,45.5]
["W40X331",35,44.5]
{"$rows_left_out":466}
{"sheet":"SP Bolted","index":7,"n_rows":485,"n_cols":3,"rows_kept":485,"cut":false,"hidden":true,"merged":[]}
["Shape","SP Length (in)","SP Depth (in)"]
["W44X335",29,47.5]
["W44X290",29,47.5]
["W44X262",29,47]
["W44X230",28,46.5]
["W40X655",29,47.5]
["W40X593",28,46.5]
["W40X503",28,45.5]
["W40X431",27,45]
["W40X397",27,44.5]
["W40X372",27,44.5]
["W40X362",27,44]
["W40X324",27,44]
["W40X297",26,43.5]
["W40X277",26,43.5]
["W40X249",26,43]
["W40X215",26,42.5]
["W40X199",26,42.5]
["W40X392",28,45.5]
["W40X331",27,44.5]
{"$rows_left_out":466}
{"sheet":"SP Welded","index":8,"n_rows":303,"n_cols":3,"rows_kept":303,"cut":false,"hidden":true,"merged":[]}
["Shape","SP Length (in)","SP Depth (in)"]
["W40X397",32,44]
["W40X372",32,44]
["W40X362",32,43.5]
["W40X324",31,43.5]
["W40X297",31,43]
["W40X277",31,43]
["W40X249",31,42.5]
["W40X215",31,42]
["W40X392",33,45]
["W40X331",32,44]
["W40X327",32,44]
["W40X294",32,43.5]
["W40X278",31,43.5]
["W40X264",31,43]
["W40X235",31,43]
["W40X211",31,42.5]
["W40X183",31,42]
["W40X167",30,42]
["W40X149",30,41.5]
{"$rows_left_out":283}