{"text_format":"1","workbook":"xlsx","n_sheets":9,"sheets":["Version","ETABS-NPSP Generator","ETABS-SP_NP-assign","ETABS-NPSP Converter","Non-prismatic","Multipliers","SP Plus Bolted","SP Bolted","SP Welded"],"not_rendered":{"charts":0,"images":2,"macros":1,"external_links":1,"defined_names":16,"comments":0,"pivot_tables":0},"unopened":[],"bounds":{"document_bytes":16777216,"sheet_cells":100000,"rows_first":2000,"rows_last":500,"rows_between":2000,"halvings":0,"cell_chars":16384,"cell_head_chars":4096},"cells_cut":0,"cells_raw":0,"read":"whole","date_system":"1900"}

{"sheet":"Version","index":0,"n_rows":47,"n_cols":27,"rows_kept":47,"cut":false,"hidden":true,"merged":[[6,0,6,26],[12,4,12,25]]}
[]
[]
[]
[]
[]
[]
["Version"]
[]
[null,"Name","ETABS Non-Prismatic Generator"]
[null,"Version","03.03.02"]
[null,"Owner","RW"]
[]
[null,"Version","Date","#","Description"]
["Insert ->",null,null,null,null,null,null,null,null,null,null,null,null,null,null,null,null,null,null,null,null,null,null,null,null,null,"<-Insert"]
[null,"03.03.02","2021-05-04",null,"Minor revision for new logo and color scheme"]
[null,null,null,1,null,"Logos and colors are updated"]
[null,"03.03.01","2020-12-07",null,"Minor Revision for new version of ETABS"]
[null,null,null,1,null,"Modified previous reference for ETABS 17 & 18 to be ETABS 19"]
[null,"03.02.01","2020-01-15",null,"Minor Revision for marketing initiative and updted connection properties"]
[null,null,null,1,null,"Implement new SidePlate logos on each tab"]
[null,null,null,2,null,"SidePlate Bolted stiffness modified to 3*Ix"]
[null,"03.01.01","2019-10-16",null,"Major Revision for new connection types"]
[null,null,null,1,null,"Added SidePlate Bolted and SidePlate Plus Bolted"]
[null,null,null,2,null,"Simplified user input by removing material input"]
[null,null,null,3,null,"Simplified data methods by getting section properties from model"]
[null,"02.02.01","2019-08-26",null,"Minor Revision for new version of ETABS"]
[null,null,null,1,null,"Modified previous reference for ETABS 2016 to ETABS 17 for functionality with both ETABS 17 and ETABS 18"]
[null,null,null,2,null,"Got rid of group section assignment tab"]
[null,"02.01.02","2018-12-06",null,"Bug Fix"]
[null,null,null,1,null,"Added error checking to trapped routines"]
[null,null,null,2,null,"Removed sheet protection for objects on the converter tab to allow the button text to be changed"]
[null,"02.01.01","2018-11-29",null,"New feature"]
[null,null,null,1,null,"New tab / module for converting all elements in a group from standard sections to NPSP sections and vice-versa"]
[null,"01.02.01","2018-08-08",null,"General bug fixes and minor improvements"]
[null,null,null,1,null,"If standard section does not exist, the tool will automatically import it from the library"]
[null,null,null,2,null,"ETABS versions option removed"]
[null,null,null,3,null,"Error Handling added to the VBA code"]
[]
[null,"01.01.01","2018-04-19",null,"Implementation of SP standardized tools and standards, including naming, versioning, ownership, and format"]
[]
[null,"V00","2016-11-02",null,"Tool created"]
[null,"V01","2016-12-07",null,"Added the option to use different versions of ETABS"]
[null,"V02","2017-02-09",null,"SP Tables for OSHPD projects added"]
[null,"V03","2017-06-20",null,"SP Tables for R=3 projects added"]
[null,"V04","2017-08-31",null,"Feature to change units added"]
[null,"V05","2017-11-17",null,"SP Tables for R=3 projects were change to use Zx'=3*Zx"]
[null,"V06","2017-12-15",null,"Change Units button removed and it automatically change the units when needed"]

{"sheet":"ETABS-NPSP Generator","index":1,"n_rows":50,"n_cols":13,"rows_kept":50,"cut":false,"hidden":false,"merged":[[3,6,4,8],[19,12,19,20],[20,12,21,20],[22,12,23,20],[28,12,29,20],[30,12,31,20],[6,0,6,9],[26,12,26,20],[18,12,18,20],[6,11,6,21],[27,12,27,20]]}
[]
[]
[null,null,null,null,null,null,"SidePlate Connection Type:","SidePlate Plus Bolted"]
[null,null,null,null,null,null,{"$f":"IF(Connection_Criteria= \"\",\"Please select a SidePlate Connection Type above\",VLOOKUP(Connection_Criteria,'Non-prismatic'!$M$3:$N$5,2,FALSE))","v":"SidePlate Plus Bolted Connections are applicable for Special Moment Frames, Intermediate Moment Frames, and Ordinary Moment Frames."}]
[]
[]
["ETABS Non-Prismatic SidePlate Section Generator",null,null,null,null,null,null,null,null,null,null,"Instructions"]
[]
[null,null,null,null,null,null,null,null,null,null,null,null,"Use this sheet to generate Non-Prismatic SidePlate frame sections and load them"]
[null,"Section","SP Length Override (in)","SP Depth Override (in)","SP Length (in)","SP Depth (in)","Section Name","SidePlate Section Name","Non-Prismatic \nSection Name",null,null,null,"into your ETABS model as SidePlate Beams for use in your analysis and design."]
[null,"W21X62",null,null,{"$f":"IF(B11=\"\",\"\",IFERROR(IF(C11<>\"\",C11,VLOOKUP($B11,'Non-prismatic'!$A$3:$C$486,2,FALSE)),\"\"))","v":18},{"$f":"IF(B11=\"\",\"\",IFERROR(IF(D11<>\"\",D11,VLOOKUP($B11,'Non-prismatic'!$A$3:$C$486,3,FALSE)),\"\"))","v":24.5},{"$f":"IF(B11=\"\",\"\",IF(COUNTIF('Non-prismatic'!$A$3:$A$486,B11)>0,UPPER(B11),\"Not Found\"))","v":"W21X62"},{"$f":"IF(B11=\"\",\"\",IF(OR(E11=\"\",F11=\"\"),\"No Data Available\",G11&\"SP\"))","v":"W21X62SP"},{"$f":"IF(B11=\"\",\"\",IF(OR(E11=\"\",F11=\"\"),\"No Data Available\",G11&\"NPSP\"&IF(C11=\"\",\"\",\"(DimA=\"&ROUND(C11,0)&\")\")&IF(D11=\"\",\"\",\"(DimB=\"&ROUND(D11,1)&\")\")))","v":"W21X62NPSP"},null,null,null,"User Notes"]
[null,"W24x76",null,null,{"$f":"IF(B12=\"\",\"\",IFERROR(IF(C12<>\"\",C12,VLOOKUP($B12,'Non-prismatic'!$A$3:$C$486,2,FALSE)),\"\"))","v":21},{"$f":"IF(B12=\"\",\"\",IFERROR(IF(D12<>\"\",D12,VLOOKUP($B12,'Non-prismatic'!$A$3:$C$486,3,FALSE)),\"\"))","v":27.5},{"$f":"IF(B12=\"\",\"\",IF(COUNTIF('Non-prismatic'!$A$3:$A$486,B12)>0,UPPER(B12),\"Not Found\"))","v":"W24X76"},"W24X76SP",{"$f":"IF(B12=\"\",\"\",IF(OR(E12=\"\",F12=\"\"),\"No Data Available\",G12&\"NPSP\"&IF(C12=\"\",\"\",\"(DimA=\"&ROUND(C12,0)&\")\")&IF(D12=\"\",\"\",\"(DimB=\"&ROUND(D12,1)&\")\")))","v":"W24X76NPSP"},null,null,null,"1. The ETABS model must be open and unlocked, valid for ETABS 19"]
[null,"W27x94",null,null,{"$f":"IF(B13=\"\",\"\",IFERROR(IF(C13<>\"\",C13,VLOOKUP($B13,'Non-prismatic'!$A$3:$C$486,2,FALSE)),\"\"))","v":23},{"$f":"IF(B13=\"\",\"\",IFERROR(IF(D13<>\"\",D13,VLOOKUP($B13,'Non-prismatic'!$A$3:$C$486,3,FALSE)),\"\"))","v":30.5},{"$f":"IF(B13=\"\",\"\",IF(COUNTIF('Non-prismatic'!$A$3:$A$486,B13)>0,UPPER(B13),\"Not Found\"))","v":"W27X94"},"W27X94SP",{"$f":"IF(B13=\"\",\"\",IF(OR(E13=\"\",F13=\"\"),\"No Data Available\",G13&\"NPSP\"&IF(C13=\"\",\"\",\"(DimA=\"&ROUND(C13,0)&\")\")&IF(D13=\"\",\"\",\"(DimB=\"&ROUND(D13,1)&\")\")))","v":"W27X94NPSP"},null,null,null,"2. You can only have 1 ETABS model open at the time you use this spreadsheet"]
[null,"W30x108",null,null,{"$f":"IF(B14=\"\",\"\",IFERROR(IF(C14<>\"\",C14,VLOOKUP($B14,'Non-prismatic'!$A$3:$C$486,2,FALSE)),\"\"))","v":26},{"$f":"IF(B14=\"\",\"\",IFERROR(IF(D14<>\"\",D14,VLOOKUP($B14,'Non-prismatic'!$A$3:$C$486,3,FALSE)),\"\"))","v":33.5},{"$f":"IF(B14=\"\",\"\",IF(COUNTIF('Non-prismatic'!$A$3:$A$486,B14)>0,UPPER(B14),\"Not Found\"))","v":"W30X108"},"W30X108SP","W30X108NPSP",null,null,null,"3. Spreadsheet cells with blue text and blue fill are editable"]
[null,"W33x130",null,null,{"$f":"IF(B15=\"\",\"\",IFERROR(IF(C15<>\"\",C15,VLOOKUP($B15,'Non-prismatic'!$A$3:$C$486,2,FALSE)),\"\"))","v":29},{"$f":"IF(B15=\"\",\"\",IFERROR(IF(D15<>\"\",D15,VLOOKUP($B15,'Non-prismatic'!$A$3:$C$486,3,FALSE)),\"\"))","v":37},{"$f":"IF(B15=\"\",\"\",IF(COUNTIF('Non-prismatic'!$A$3:$A$486,B15)>0,UPPER(B15),\"Not Found\"))","v":"W33X130"},"W33X130SP","W33X130NPSP",null,null,null,"4. Duplicate frame sections will only be imported into the ETABS model once"]
[null,"W36x150",null,null,{"$f":"IF(B16=\"\",\"\",IFERROR(IF(C16<>\"\",C16,VLOOKUP($B16,'Non-prismatic'!$A$3:$C$486,2,FALSE)),\"\"))","v":31},{"$f":"IF(B16=\"\",\"\",IFERROR(IF(D16<>\"\",D16,VLOOKUP($B16,'Non-prismatic'!$A$3:$C$486,3,FALSE)),\"\"))","v":39.5},{"$f":"IF(B16=\"\",\"\",IF(COUNTIF('Non-prismatic'!$A$3:$A$486,B16)>0,UPPER(B16),\"Not Found\"))","v":"W36X150"},"W36X150SP","W36X150NPSP",null,null,null,"5. Refer to the SidePlate website for other requirements for modeling SidePlate in ETABS"]
[null,null,null,null,{"$f":"IF(B17=\"\",\"\",IFERROR(IF(C17<>\"\",C17,VLOOKUP($B17,'Non-prismatic'!$A$3:$C$486,2,FALSE)),\"\"))","v":""},{"$f":"IF(B17=\"\",\"\",IFERROR(IF(D17<>\"\",D17,VLOOKUP($B17,'Non-prismatic'!$A$3:$C$486,3,FALSE)),\"\"))","v":""},{"$f":"IF(B17=\"\",\"\",IF(COUNTIF('Non-prismatic'!$A$3:$A$486,B17)>0,UPPER(B17),\"Not Found\"))","v":""},"",""]
[null,null,null,null,{"$f":"IF(B18=\"\",\"\",IFERROR(IF(C18<>\"\",C18,VLOOKUP($B18,'Non-prismatic'!$A$3:$C$486,2,FALSE)),\"\"))","v":""},{"$f":"IF(B18=\"\",\"\",IFERROR(IF(D18<>\"\",D18,VLOOKUP($B18,'Non-prismatic'!$A$3:$C$486,3,FALSE)),\"\"))","v":""},{"$f":"IF(B18=\"\",\"\",IF(COUNTIF('Non-prismatic'!$A$3:$A$486,B18)>0,UPPER(B18),\"Not Found\"))","v":""},"","",null,null,null,"Generating Non-Prismatic SidePlate  Sections"]
[null,null,null,null,{"$f":"IF(B19=\"\",\"\",IFERROR(IF(C19<>\"\",C19,VLOOKUP($B19,'Non-prismatic'!$A$3:$C$486,2,FALSE)),\"\"))","v":""},{"$f":"IF(B19=\"\",\"\",IFERROR(IF(D19<>\"\",D19,VLOOKUP($B19,'Non-prismatic'!$A$3:$C$486,3,FALSE)),\"\"))","v":""},{"$f":"IF(B19=\"\",\"\",IF(COUNTIF('Non-prismatic'!$A$3:$A$486,B19)>0,UPPER(B19),\"Not Found\"))","v":""},"","",null,null,null,"1. Open the ETABS model you wish to add Non-Prismatic SidePlate sections to."]
[null,null,null,null,{"$f":"IF(B20=\"\",\"\",IFERROR(IF(C20<>\"\",C20,VLOOKUP($B20,'Non-prismatic'!$A$3:$C$486,2,FALSE)),\"\"))","v":""},{"$f":"IF(B20=\"\",\"\",IFERROR(IF(D20<>\"\",D20,VLOOKUP($B20,'Non-prismatic'!$A$3:$C$486,3,FALSE)),\"\"))","v":""},{"$f":"IF(B20=\"\",\"\",IF(COUNTIF('Non-prismatic'!$A$3:$A$486,B20)>0,UPPER(B20),\"Not Found\"))","v":""},"","",null,null,null,"2. At the top of this sheet, use the drop down menu to select the SidePlate Connection Type."]
[null,null,null,null,{"$f":"IF(B21=\"\",\"\",IFERROR(IF(C21<>\"\",C21,VLOOKUP($B21,'Non-prismatic'!$A$3:$C$486,2,FALSE)),\"\"))","v":""},{"$f":"IF(B21=\"\",\"\",IFERROR(IF(D21<>\"\",D21,VLOOKUP($B21,'Non-prismatic'!$A$3:$C$486,3,FALSE)),\"\"))","v":""},{"$f":"IF(B21=\"\",\"\",IF(COUNTIF('Non-prismatic'!$A$3:$A$486,B21)>0,UPPER(B21),\"Not Found\"))","v":""},"","",null,null,null,"3. Once you have entered all the sections you wish to add into your model, click the button \"Generate Non-Prismatic Sections\""]
[null,null,null,null,{"$f":"IF(B22=\"\",\"\",IFERROR(IF(C22<>\"\",C22,VLOOKUP($B22,'Non-prismatic'!$A$3:$C$486,2,FALSE)),\"\"))","v":""},{"$f":"IF(B22=\"\",\"\",IFERROR(IF(D22<>\"\",D22,VLOOKUP($B22,'Non-prismatic'!$A$3:$C$486,3,FALSE)),\"\"))","v":""},{"$f":"IF(B22=\"\",\"\",IF(COUNTIF('Non-prismatic'!$A$3:$A$486,B22)>0,UPPER(B22),\"Not Found\"))","v":""},"",""]
[null,null,null,null,{"$f":"IF(B23=\"\",\"\",IFERROR(IF(C23<>\"\",C23,VLOOKUP($B23,'Non-prismatic'!$A$3:$C$486,2,FALSE)),\"\"))","v":""},{"$f":"IF(B23=\"\",\"\",IFERROR(IF(D23<>\"\",D23,VLOOKUP($B23,'Non-prismatic'!$A$3:$C$486,3,FALSE)),\"\"))","v":""},{"$f":"IF(B23=\"\",\"\",IF(COUNTIF('Non-prismatic'!$A$3:$A$486,B23)>0,UPPER(B23),\"Not Found\"))","v":""},"","",null,null,null,"4. Verify that the SP Non-prismatic sections were added to your ETABS model: Define -> Sections properties -> Frame Sections"]
[null,null,null,null,{"$f":"IF(B24=\"\",\"\",IFERROR(IF(C24<>\"\",C24,VLOOKUP($B24,'Non-prismatic'!$A$3:$C$486,2,FALSE)),\"\"))","v":""},{"$f":"IF(B24=\"\",\"\",IFERROR(IF(D24<>\"\",D24,VLOOKUP($B24,'Non-prismatic'!$A$3:$C$486,3,FALSE)),\"\"))","v":""},{"$f":"IF(B24=\"\",\"\",IF(COUNTIF('Non-prismatic'!$A$3:$A$486,B24)>0,UPPER(B24),\"Not Found\"))","v":""},"",""]
[null,null,null,null,{"$f":"IF(B25=\"\",\"\",IFERROR(IF(C25<>\"\",C25,VLOOKUP($B25,'Non-prismatic'!$A$3:$C$486,2,FALSE)),\"\"))","v":""},{"$f":"IF(B25=\"\",\"\",IFERROR(IF(D25<>\"\",D25,VLOOKUP($B25,'Non-prismatic'!$A$3:$C$486,3,FALSE)),\"\"))","v":""},{"$f":"IF(B25=\"\",\"\",IF(COUNTIF('Non-prismatic'!$A$3:$A$486,B25)>0,UPPER(B25),\"Not Found\"))","v":""},"",""]
[null,null,null,null,{"$f":"IF(B26=\"\",\"\",IFERROR(IF(C26<>\"\",C26,VLOOKUP($B26,'Non-prismatic'!$A$3:$C$486,2,FALSE)),\"\"))","v":""},{"$f":"IF(B26=\"\",\"\",IFERROR(IF(D26<>\"\",D26,VLOOKUP($B26,'Non-prismatic'!$A$3:$C$486,3,FALSE)),\"\"))","v":""},{"$f":"IF(B26=\"\",\"\",IF(COUNTIF('Non-prismatic'!$A$3:$A$486,B26)>0,UPPER(B26),\"Not Found\"))","v":""},"","",null,null,null,"Converting All Lateral Beams to Non-Prismatic Sections"]
[null,null,null,null,{"$f":"IF(B27=\"\",\"\",IFERROR(IF(C27<>\"\",C27,VLOOKUP($B27,'Non-prismatic'!$A$3:$C$486,2,FALSE)),\"\"))","v":""},{"$f":"IF(B27=\"\",\"\",IFERROR(IF(D27<>\"\",D27,VLOOKUP($B27,'Non-prismatic'!$A$3:$C$486,3,FALSE)),\"\"))","v":""},{"$f":"IF(B27=\"\",\"\",IF(COUNTIF('Non-prismatic'!$A$3:$A$486,B27)>0,UPPER(B27),\"Not Found\"))","v":""},"","",null,null,null,"1. Open the ETABS model you wish to convert to Non-Prismatic SidePlate sections"]
[null,null,null,null,{"$f":"IF(B28=\"\",\"\",IFERROR(IF(C28<>\"\",C28,VLOOKUP($B28,'Non-prismatic'!$A$3:$C$486,2,FALSE)),\"\"))","v":""},{"$f":"IF(B28=\"\",\"\",IFERROR(IF(D28<>\"\",D28,VLOOKUP($B28,'Non-prismatic'!$A$3:$C$486,3,FALSE)),\"\"))","v":""},{"$f":"IF(B28=\"\",\"\",IF(COUNTIF('Non-prismatic'!$A$3:$A$486,B28)>0,UPPER(B28),\"Not Found\"))","v":""},"","",null,null,null,"2. Assign all of the intended SidePlate beams to one group"]
[null,null,null,null,{"$f":"IF(B29=\"\",\"\",IFERROR(IF(C29<>\"\",C29,VLOOKUP($B29,'Non-prismatic'!$A$3:$C$486,2,FALSE)),\"\"))","v":""},{"$f":"IF(B29=\"\",\"\",IFERROR(IF(D29<>\"\",D29,VLOOKUP($B29,'Non-prismatic'!$A$3:$C$486,3,FALSE)),\"\"))","v":""},{"$f":"IF(B29=\"\",\"\",IF(COUNTIF('Non-prismatic'!$A$3:$A$486,B29)>0,UPPER(B29),\"Not Found\"))","v":""},"","",null,null,null,"3. Ensure standard moment connections are being used : Select all -> Assign -> Frame -> Moment Frame Beam Connection Type -> Select Standard Moment Connection"]
[null,null,null,null,{"$f":"IF(B30=\"\",\"\",IFERROR(IF(C30<>\"\",C30,VLOOKUP($B30,'Non-prismatic'!$A$3:$C$486,2,FALSE)),\"\"))","v":""},{"$f":"IF(B30=\"\",\"\",IFERROR(IF(D30<>\"\",D30,VLOOKUP($B30,'Non-prismatic'!$A$3:$C$486,3,FALSE)),\"\"))","v":""},{"$f":"IF(B30=\"\",\"\",IF(COUNTIF('Non-prismatic'!$A$3:$A$486,B30)>0,UPPER(B30),\"Not Found\"))","v":""},"",""]
[null,null,null,null,{"$f":"IF(B31=\"\",\"\",IFERROR(IF(C31<>\"\",C31,VLOOKUP($B31,'Non-prismatic'!$A$3:$C$486,2,FALSE)),\"\"))","v":""},{"$f":"IF(B31=\"\",\"\",IFERROR(IF(D31<>\"\",D31,VLOOKUP($B31,'Non-prismatic'!$A$3:$C$486,3,FALSE)),\"\"))","v":""},{"$f":"IF(B31=\"\",\"\",IF(COUNTIF('Non-prismatic'!$A$3:$A$486,B31)>0,UPPER(B31),\"Not Found\"))","v":""},"","",null,null,null,"4. Use the ETABS-NPSP Converter tab to convert the entire group of beams from standard sections to Non-Prismatic SidePlate sections"]
[null,null,null,null,{"$f":"IF(B32=\"\",\"\",IFERROR(IF(C32<>\"\",C32,VLOOKUP($B32,'Non-prismatic'!$A$3:$C$486,2,FALSE)),\"\"))","v":""},{"$f":"IF(B32=\"\",\"\",IFERROR(IF(D32<>\"\",D32,VLOOKUP($B32,'Non-prismatic'!$A$3:$C$486,3,FALSE)),\"\"))","v":""},{"$f":"IF(B32=\"\",\"\",IF(COUNTIF('Non-prismatic'!$A$3:$A$486,B32)>0,UPPER(B32),\"Not Found\"))","v":""},"",""]
[null,null,null,null,{"$f":"IF(B33=\"\",\"\",IFERROR(IF(C33<>\"\",C33,VLOOKUP($B33,'Non-prismatic'!$A$3:$C$486,2,FALSE)),\"\"))","v":""},{"$f":"IF(B33=\"\",\"\",IFERROR(IF(D33<>\"\",D33,VLOOKUP($B33,'Non-prismatic'!$A$3:$C$486,3,FALSE)),\"\"))","v":""},{"$f":"IF(B33=\"\",\"\",IF(COUNTIF('Non-prismatic'!$A$3:$A$486,B33)>0,UPPER(B33),\"Not Found\"))","v":""},"",""]
[null,null,null,null,{"$f":"IF(B34=\"\",\"\",IFERROR(IF(C34<>\"\",C34,VLOOKUP($B34,'Non-prismatic'!$A$3:$C$486,2,FALSE)),\"\"))","v":""},{"$f":"IF(B34=\"\",\"\",IFERROR(IF(D34<>\"\",D34,VLOOKUP($B34,'Non-prismatic'!$A$3:$C$486,3,FALSE)),\"\"))","v":""},{"$f":"IF(B34=\"\",\"\",IF(COUNTIF('Non-prismatic'!$A$3:$A$486,B34)>0,UPPER(B34),\"Not Found\"))","v":""},"",""]
[null,null,null,null,{"$f":"IF(B35=\"\",\"\",IFERROR(IF(C35<>\"\",C35,VLOOKUP($B35,'Non-prismatic'!$A$3:$C$486,2,FALSE)),\"\"))","v":""},{"$f":"IF(B35=\"\",\"\",IFERROR(IF(D35<>\"\",D35,VLOOKUP($B35,'Non-prismatic'!$A$3:$C$486,3,FALSE)),\"\"))","v":""},{"$f":"IF(B35=\"\",\"\",IF(COUNTIF('Non-prismatic'!$A$3:$A$486,B35)>0,UPPER(B35),\"Not Found\"))","v":""},"",""]
[null,null,null,null,{"$f":"IF(B36=\"\",\"\",IFERROR(IF(C36<>\"\",C36,VLOOKUP($B36,'Non-prismatic'!$A$3:$C$486,2,FALSE)),\"\"))","v":""},{"$f":"IF(B36=\"\",\"\",IFERROR(IF(D36<>\"\",D36,VLOOKUP($B36,'Non-prismatic'!$A$3:$C$486,3,FALSE)),\"\"))","v":""},{"$f":"IF(B36=\"\",\"\",IF(COUNTIF('Non-prismatic'!$A$3:$A$486,B36)>0,UPPER(B36),\"Not Found\"))","v":""},"",""]
[null,null,null,null,{"$f":"IF(B37=\"\",\"\",IFERROR(IF(C37<>\"\",C37,VLOOKUP($B37,'Non-prismatic'!$A$3:$C$486,2,FALSE)),\"\"))","v":""},{"$f":"IF(B37=\"\",\"\",IFERROR(IF(D37<>\"\",D37,VLOOKUP($B37,'Non-prismatic'!$A$3:$C$486,3,FALSE)),\"\"))","v":""},{"$f":"IF(B37=\"\",\"\",IF(COUNTIF('Non-prismatic'!$A$3:$A$486,B37)>0,UPPER(B37),\"Not Found\"))","v":""},"",""]
[null,null,null,null,{"$f":"IF(B38=\"\",\"\",IFERROR(IF(C38<>\"\",C38,VLOOKUP($B38,'Non-prismatic'!$A$3:$C$486,2,FALSE)),\"\"))","v":""},{"$f":"IF(B38=\"\",\"\",IFERROR(IF(D38<>\"\",D38,VLOOKUP($B38,'Non-prismatic'!$A$3:$C$486,3,FALSE)),\"\"))","v":""},{"$f":"IF(B38=\"\",\"\",IF(COUNTIF('Non-prismatic'!$A$3:$A$486,B38)>0,UPPER(B38),\"Not Found\"))","v":""},"",""]
[null,null,null,null,{"$f":"IF(B39=\"\",\"\",IFERROR(IF(C39<>\"\",C39,VLOOKUP($B39,'Non-prismatic'!$A$3:$C$486,2,FALSE)),\"\"))","v":""},{"$f":"IF(B39=\"\",\"\",IFERROR(IF(D39<>\"\",D39,VLOOKUP($B39,'Non-prismatic'!$A$3:$C$486,3,FALSE)),\"\"))","v":""},{"$f":"IF(B39=\"\",\"\",IF(COUNTIF('Non-prismatic'!$A$3:$A$486,B39)>0,UPPER(B39),\"Not Found\"))","v":""},"",""]
[null,null,null,null,{"$f":"IF(B40=\"\",\"\",IFERROR(IF(C40<>\"\",C40,VLOOKUP($B40,'Non-prismatic'!$A$3:$C$486,2,FALSE)),\"\"))","v":""},{"$f":"IF(B40=\"\",\"\",IFERROR(IF(D40<>\"\",D40,VLOOKUP($B40,'Non-prismatic'!$A$3:$C$486,3,FALSE)),\"\"))","v":""},{"$f":"IF(B40=\"\",\"\",IF(COUNTIF('Non-prismatic'!$A$3:$A$486,B40)>0,UPPER(B40),\"Not Found\"))","v":""},"",""]
[null,null,null,null,{"$f":"IF(B41=\"\",\"\",IFERROR(IF(C41<>\"\",C41,VLOOKUP($B41,'Non-prismatic'!$A$3:$C$486,2,FALSE)),\"\"))","v":""},{"$f":"IF(B41=\"\",\"\",IFERROR(IF(D41<>\"\",D41,VLOOKUP($B41,'Non-prismatic'!$A$3:$C$486,3,FALSE)),\"\"))","v":""},{"$f":"IF(B41=\"\",\"\",IF(COUNTIF('Non-prismatic'!$A$3:$A$486,B41)>0,UPPER(B41),\"Not Found\"))","v":""},"",""]
[null,null,null,null,{"$f":"IF(B42=\"\",\"\",IFERROR(IF(C42<>\"\",C42,VLOOKUP($B42,'Non-prismatic'!$A$3:$C$486,2,FALSE)),\"\"))","v":""},{"$f":"IF(B42=\"\",\"\",IFERROR(IF(D42<>\"\",D42,VLOOKUP($B42,'Non-prismatic'!$A$3:$C$486,3,FALSE)),\"\"))","v":""},{"$f":"IF(B42=\"\",\"\",IF(COUNTIF('Non-prismatic'!$A$3:$A$486,B42)>0,UPPER(B42),\"Not Found\"))","v":""},"",""]
[null,null,null,null,{"$f":"IF(B43=\"\",\"\",IFERROR(IF(C43<>\"\",C43,VLOOKUP($B43,'Non-prismatic'!$A$3:$C$486,2,FALSE)),\"\"))","v":""},{"$f":"IF(B43=\"\",\"\",IFERROR(IF(D43<>\"\",D43,VLOOKUP($B43,'Non-prismatic'!$A$3:$C$486,3,FALSE)),\"\"))","v":""},{"$f":"IF(B43=\"\",\"\",IF(COUNTIF('Non-prismatic'!$A$3:$A$486,B43)>0,UPPER(B43),\"Not Found\"))","v":""},"",""]
[null,null,null,null,{"$f":"IF(B44=\"\",\"\",IFERROR(IF(C44<>\"\",C44,VLOOKUP($B44,'Non-prismatic'!$A$3:$C$486,2,FALSE)),\"\"))","v":""},{"$f":"IF(B44=\"\",\"\",IFERROR(IF(D44<>\"\",D44,VLOOKUP($B44,'Non-prismatic'!$A$3:$C$486,3,FALSE)),\"\"))","v":""},{"$f":"IF(B44=\"\",\"\",IF(COUNTIF('Non-prismatic'!$A$3:$A$486,B44)>0,UPPER(B44),\"Not Found\"))","v":""},"",""]
[null,null,null,null,{"$f":"IF(B45=\"\",\"\",IFERROR(IF(C45<>\"\",C45,VLOOKUP($B45,'Non-prismatic'!$A$3:$C$486,2,FALSE)),\"\"))","v":""},{"$f":"IF(B45=\"\",\"\",IFERROR(IF(D45<>\"\",D45,VLOOKUP($B45,'Non-prismatic'!$A$3:$C$486,3,FALSE)),\"\"))","v":""},{"$f":"IF(B45=\"\",\"\",IF(COUNTIF('Non-prismatic'!$A$3:$A$486,B45)>0,UPPER(B45),\"Not Found\"))","v":""},"",""]
[null,null,null,null,{"$f":"IF(B46=\"\",\"\",IFERROR(IF(C46<>\"\",C46,VLOOKUP($B46,'Non-prismatic'!$A$3:$C$486,2,FALSE)),\"\"))","v":""},{"$f":"IF(B46=\"\",\"\",IFERROR(IF(D46<>\"\",D46,VLOOKUP($B46,'Non-prismatic'!$A$3:$C$486,3,FALSE)),\"\"))","v":""},{"$f":"IF(B46=\"\",\"\",IF(COUNTIF('Non-prismatic'!$A$3:$A$486,B46)>0,UPPER(B46),\"Not Found\"))","v":""},"",""]
[null,null,null,null,{"$f":"IF(B47=\"\",\"\",IFERROR(IF(C47<>\"\",C47,VLOOKUP($B47,'Non-prismatic'!$A$3:$C$486,2,FALSE)),\"\"))","v":""},{"$f":"IF(B47=\"\",\"\",IFERROR(IF(D47<>\"\",D47,VLOOKUP($B47,'Non-prismatic'!$A$3:$C$486,3,FALSE)),\"\"))","v":""},{"$f":"IF(B47=\"\",\"\",IF(COUNTIF('Non-prismatic'!$A$3:$A$486,B47)>0,UPPER(B47),\"Not Found\"))","v":""},"",""]
[null,null,null,null,{"$f":"IF(B48=\"\",\"\",IFERROR(IF(C48<>\"\",C48,VLOOKUP($B48,'Non-prismatic'!$A$3:$C$486,2,FALSE)),\"\"))","v":""},{"$f":"IF(B48=\"\",\"\",IFERROR(IF(D48<>\"\",D48,VLOOKUP($B48,'Non-prismatic'!$A$3:$C$486,3,FALSE)),\"\"))","v":""},{"$f":"IF(B48=\"\",\"\",IF(COUNTIF('Non-prismatic'!$A$3:$A$486,B48)>0,UPPER(B48),\"Not Found\"))","v":""},"",""]
[null,null,null,null,{"$f":"IF(B49=\"\",\"\",IFERROR(IF(C49<>\"\",C49,VLOOKUP($B49,'Non-prismatic'!$A$3:$C$486,2,FALSE)),\"\"))","v":""},{"$f":"IF(B49=\"\",\"\",IFERROR(IF(D49<>\"\",D49,VLOOKUP($B49,'Non-prismatic'!$A$3:$C$486,3,FALSE)),\"\"))","v":""},{"$f":"IF(B49=\"\",\"\",IF(COUNTIF('Non-prismatic'!$A$3:$A$486,B49)>0,UPPER(B49),\"Not Found\"))","v":""},"",""]
[null,null,null,null,{"$f":"IF(B50=\"\",\"\",IFERROR(IF(C50<>\"\",C50,VLOOKUP($B50,'Non-prismatic'!$A$3:$C$486,2,FALSE)),\"\"))","v":""},{"$f":"IF(B50=\"\",\"\",IFERROR(IF(D50<>\"\",D50,VLOOKUP($B50,'Non-prismatic'!$A$3:$C$486,3,FALSE)),\"\"))","v":""},{"$f":"IF(B50=\"\",\"\",IF(COUNTIF('Non-prismatic'!$A$3:$A$486,B50)>0,UPPER(B50),\"Not Found\"))","v":""},"",""]

{"sheet":"ETABS-SP_NP-assign","index":2,"n_rows":23,"n_cols":5,"rows_kept":23,"cut":false,"hidden":true,"merged":[[6,0,6,11],[20,4,21,10],[9,4,9,11]]}
[]
[]
[]
[]
[]
[]
["ETABS Assign Section by Group"]
[]
[]
[null,"Group to be replaced","New Section",null,"Instructions"]
[null,"Lateral Roof","W21X83NPSP"]
[null,"Lateral Level 03","W24X84NPSP",null,"Notes"]
[null,"Lateral Level 02","W27X94NPSP",null,"1. You must have your ETABS model opened"]
[null,null,null,null,"2. You can only have 1 ETABS model opened at the time you use this spreadsheet"]
[]
[null,null,null,null,"Instructions"]
[null,null,null,null,"1. Create groups for the sections that you want to replace: Define -> Group definitions"]
[null,null,null,null,"2. Assign beams to the groups created"]
[null,null,null,null,"3. Use column \"B\" to write the groups of beams that you want to change the section"]
[null,null,null,null,"4. Use column \"C\" to write the name of the new section. Ex: W36X170NPSP"]
[null,null,null,null,"5. Once you have added all the sections you want to change, click the button \"Assign Sections to Groups\""]
[]
[null,null,null,null,"6.  All sections within the group will be replaced with the new section defined."]

{"sheet":"ETABS-NPSP Converter","index":3,"n_rows":39,"n_cols":3,"rows_kept":39,"cut":false,"hidden":false,"merged":[[25,1,25,9],[26,1,26,9],[28,1,28,9],[8,2,8,3],[6,0,6,10],[10,2,10,3],[9,2,9,3],[12,0,12,10],[40,1,40,10],[29,1,29,9],[27,1,27,9],[34,1,34,9],[38,1,38,9],[32,1,32,9],[39,1,39,10]]}
[]
[]
[]
[]
[]
[]
["ETABS Non-Prismatic SidePlate Beam Converter"]
[]
[null,"Convert Beams from :","Standard to Non-Prismatic"]
[null,"Group to convert :"]
[null,"SidePlate Connection Type :","SidePlate Plus Bolted"]
[]
["Instructions"]
[]
[null,"Use this sheet to convert a whole group of members in your ETABS model from standard shapes "]
[null,"to Non-Prismatic SidePlate sections or vice-versa."]
[]
[null,"User Notes"]
[null,"1. The ETABS model must be open and unlocked, valid for ETABS 19"]
[null,"2. You can only have 1 ETABS model open at the time you use this spreadsheet"]
[null,"3. Spreadsheet cells with blue text and blue fill are editable"]
[null,"4. Duplicate frame sections will only be imported into the ETABS model once"]
[null,"5. Refer to the SidePlate website for other requirements for modeling SidePlate in ETABS"]
[]
[null,"General Instructions:"]
[null,"1. Open the ETABS model you wish to convert"]
[null,"2. Create a group for the Lateral Beams only"]
[null,"3. Use Cell \"C9\" to select the operation you want to perform"]
[null,"4. Click the button \"Get List of Groups from ETABS\""]
[null,"5. Use Cell \"C10\" to select the ETABS group that you want to convert"]
[]
[null,"Instructions for converting from Standard to Non-Prismatic SidePlate:"]
[null,"1. Make sure all the beams from the group are assigned to \"Standard Moment Connection\" - Assign -> Frame -> Moment Frame Beam Connection Type"]
[null,"2. Use Cell \"C11\" to select the connection type used for this model"]
[null,"3. Click the button \"Convert Group to Non-Prismatic Section\""]
[null,"4. Confirm that the SidePlate built-in feature and the Non-prismatic sections do not occur in the same beams"]
[]
[null,"Instructions for converting from Non-Prismatic SidePlate to Standard:"]
[null,"1. Click the button \"Convert Group to Standard Sections\""]

{"sheet":"Non-prismatic","index":4,"n_rows":486,"n_cols":14,"rows_kept":486,"cut":false,"hidden":true,"merged":[[0,9,0,10]]}
["Shape","SP Length (in)","SP Depth (in)",null,"Groups",null,"Materials",null,"Selected Connection","Multipliers",null,null,"Connection Type"]
[]
[{"$f":"IF($I$3=$M$3,'SP Plus Bolted'!A2,IF($I$3=$M$4,'SP Bolted'!A2,IF($I$3=$M$5,'SP Welded'!A2,\"\")))","v":"W44X335"},{"$f":"IF($I$3=$M$3,'SP Plus Bolted'!B2,IF($I$3=$M$4,'SP Bolted'!B2,IF($I$3=$M$5,'SP Welded'!B2,\"\")))","v":38},{"$f":"IF($I$3=$M$3,'SP Plus Bolted'!C2,IF($I$3=$M$4,'SP Bolted'!C2,IF($I$3=$M$5,'SP Welded'!C2,\"\")))","v":47.5},null,null,null,"A992Fy50",null,{"$f":"'ETABS-NPSP Generator'!Connection_Criteria","v":"SidePlate Plus Bolted"},"Ix",{"$f":"VLOOKUP(I3,Multipliers!$B$22:$E$24,2,FALSE)","v":3},null,"SidePlate Plus Bolted","SidePlate Plus Bolted Connections are applicable for Special Moment Frames, Intermediate Moment Frames, and Ordinary Moment Frames."]
[{"$f":"IF($I$3=$M$3,'SP Plus Bolted'!A3,IF($I$3=$M$4,'SP Bolted'!A3,IF($I$3=$M$5,'SP Welded'!A3,\"\")))","v":"W44X290"},{"$f":"IF($I$3=$M$3,'SP Plus Bolted'!B3,IF($I$3=$M$4,'SP Bolted'!B3,IF($I$3=$M$5,'SP Welded'!B3,\"\")))","v":38},{"$f":"IF($I$3=$M$3,'SP Plus Bolted'!C3,IF($I$3=$M$4,'SP Bolted'!C3,IF($I$3=$M$5,'SP Welded'!C3,\"\")))","v":47.5},null,null,null,"4000Psi(NWC)",null,null,"Sx",{"$f":"VLOOKUP(I3,Multipliers!$B$22:$E$24,3,FALSE)","v":2.5},null,"SidePlate Bolted","SidePlate Bolted Connections are applicable for steel systems not specifically detailed for seismic resistance."]
[{"$f":"IF($I$3=$M$3,'SP Plus Bolted'!A4,IF($I$3=$M$4,'SP Bolted'!A4,IF($I$3=$M$5,'SP Welded'!A4,\"\")))","v":"W44X262"},{"$f":"IF($I$3=$M$3,'SP Plus Bolted'!B4,IF($I$3=$M$4,'SP Bolted'!B4,IF($I$3=$M$5,'SP Welded'!B4,\"\")))","v":37},{"$f":"IF($I$3=$M$3,'SP Plus Bolted'!C4,IF($I$3=$M$4,'SP Bolted'!C4,IF($I$3=$M$5,'SP Welded'!C4,\"\")))","v":47},null,null,null,"A615Gr60",null,null,"Zx",{"$f":"VLOOKUP(I3,Multipliers!$B$22:$E$24,4,FALSE)","v":2.5},null,"SidePlate Welded","SidePlate Welded connectiosn are applicable for Special Moment Frames."]
[{"$f":"IF($I$3=$M$3,'SP Plus Bolted'!A5,IF($I$3=$M$4,'SP Bolted'!A5,IF($I$3=$M$5,'SP Welded'!A5,\"\")))","v":"W44X230"},{"$f":"IF($I$3=$M$3,'SP Plus Bolted'!B5,IF($I$3=$M$4,'SP Bolted'!B5,IF($I$3=$M$5,'SP Welded'!B5,\"\")))","v":37},{"$f":"IF($I$3=$M$3,'SP Plus Bolted'!C5,IF($I$3=$M$4,'SP Bolted'!C5,IF($I$3=$M$5,'SP Welded'!C5,\"\")))","v":46.5},null,null,null,"A416Gr270"]
[{"$f":"IF($I$3=$M$3,'SP Plus Bolted'!A6,IF($I$3=$M$4,'SP Bolted'!A6,IF($I$3=$M$5,'SP Welded'!A6,\"\")))","v":"W40X655"},{"$f":"IF($I$3=$M$3,'SP Plus Bolted'!B6,IF($I$3=$M$4,'SP Bolted'!B6,IF($I$3=$M$5,'SP Welded'!B6,\"\")))","v":38},{"$f":"IF($I$3=$M$3,'SP Plus Bolted'!C6,IF($I$3=$M$4,'SP Bolted'!C6,IF($I$3=$M$5,'SP Welded'!C6,\"\")))","v":47.5},null,null,null,"4000psi(LWC)"]
[{"$f":"IF($I$3=$M$3,'SP Plus Bolted'!A7,IF($I$3=$M$4,'SP Bolted'!A7,IF($I$3=$M$5,'SP Welded'!A7,\"\")))","v":"W40X593"},{"$f":"IF($I$3=$M$3,'SP Plus Bolted'!B7,IF($I$3=$M$4,'SP Bolted'!B7,IF($I$3=$M$5,'SP Welded'!B7,\"\")))","v":37},{"$f":"IF($I$3=$M$3,'SP Plus Bolted'!C7,IF($I$3=$M$4,'SP Bolted'!C7,IF($I$3=$M$5,'SP Welded'!C7,\"\")))","v":46.5},null,null,null,"A500GrB46"]
[{"$f":"IF($I$3=$M$3,'SP Plus Bolted'!A8,IF($I$3=$M$4,'SP Bolted'!A8,IF($I$3=$M$5,'SP Welded'!A8,\"\")))","v":"W40X503"},{"$f":"IF($I$3=$M$3,'SP Plus Bolted'!B8,IF($I$3=$M$4,'SP Bolted'!B8,IF($I$3=$M$5,'SP Welded'!B8,\"\")))","v":36},{"$f":"IF($I$3=$M$3,'SP Plus Bolted'!C8,IF($I$3=$M$4,'SP Bolted'!C8,IF($I$3=$M$5,'SP Welded'!C8,\"\")))","v":45.5},null,null,null,"A913Gr65"]
[{"$f":"IF($I$3=$M$3,'SP Plus Bolted'!A9,IF($I$3=$M$4,'SP Bolted'!A9,IF($I$3=$M$5,'SP Welded'!A9,\"\")))","v":"W40X431"},{"$f":"IF($I$3=$M$3,'SP Plus Bolted'!B9,IF($I$3=$M$4,'SP Bolted'!B9,IF($I$3=$M$5,'SP Welded'!B9,\"\")))","v":36},{"$f":"IF($I$3=$M$3,'SP Plus Bolted'!C9,IF($I$3=$M$4,'SP Bolted'!C9,IF($I$3=$M$5,'SP Welded'!C9,\"\")))","v":45}]
[{"$f":"IF($I$3=$M$3,'SP Plus Bolted'!A10,IF($I$3=$M$4,'SP Bolted'!A10,IF($I$3=$M$5,'SP Welded'!A10,\"\")))","v":"W40X397"},{"$f":"IF($I$3=$M$3,'SP Plus Bolted'!B10,IF($I$3=$M$4,'SP Bolted'!B10,IF($I$3=$M$5,'SP Welded'!B10,\"\")))","v":35},{"$f":"IF($I$3=$M$3,'SP Plus Bolted'!C10,IF($I$3=$M$4,'SP Bolted'!C10,IF($I$3=$M$5,'SP Welded'!C10,\"\")))","v":44.5}]
[{"$f":"IF($I$3=$M$3,'SP Plus Bolted'!A11,IF($I$3=$M$4,'SP Bolted'!A11,IF($I$3=$M$5,'SP Welded'!A11,\"\")))","v":"W40X372"},{"$f":"IF($I$3=$M$3,'SP Plus Bolted'!B11,IF($I$3=$M$4,'SP Bolted'!B11,IF($I$3=$M$5,'SP Welded'!B11,\"\")))","v":35},{"$f":"IF($I$3=$M$3,'SP Plus Bolted'!C11,IF($I$3=$M$4,'SP Bolted'!C11,IF($I$3=$M$5,'SP Welded'!C11,\"\")))","v":44.5}]
[{"$f":"IF($I$3=$M$3,'SP Plus Bolted'!A12,IF($I$3=$M$4,'SP Bolted'!A12,IF($I$3=$M$5,'SP Welded'!A12,\"\")))","v":"W40X362"},{"$f":"IF($I$3=$M$3,'SP Plus Bolted'!B12,IF($I$3=$M$4,'SP Bolted'!B12,IF($I$3=$M$5,'SP Welded'!B12,\"\")))","v":35},{"$f":"IF($I$3=$M$3,'SP Plus Bolted'!C12,IF($I$3=$M$4,'SP Bolted'!C12,IF($I$3=$M$5,'SP Welded'!C12,\"\")))","v":44}]
[{"$f":"IF($I$3=$M$3,'SP Plus Bolted'!A13,IF($I$3=$M$4,'SP Bolted'!A13,IF($I$3=$M$5,'SP Welded'!A13,\"\")))","v":"W40X324"},{"$f":"IF($I$3=$M$3,'SP Plus Bolted'!B13,IF($I$3=$M$4,'SP Bolted'!B13,IF($I$3=$M$5,'SP Welded'!B13,\"\")))","v":35},{"$f":"IF($I$3=$M$3,'SP Plus Bolted'!C13,IF($I$3=$M$4,'SP Bolted'!C13,IF($I$3=$M$5,'SP Welded'!C13,\"\")))","v":44}]
[{"$f":"IF($I$3=$M$3,'SP Plus Bolted'!A14,IF($I$3=$M$4,'SP Bolted'!A14,IF($I$3=$M$5,'SP Welded'!A14,\"\")))","v":"W40X297"},{"$f":"IF($I$3=$M$3,'SP Plus Bolted'!B14,IF($I$3=$M$4,'SP Bolted'!B14,IF($I$3=$M$5,'SP Welded'!B14,\"\")))","v":34},{"$f":"IF($I$3=$M$3,'SP Plus Bolted'!C14,IF($I$3=$M$4,'SP Bolted'!C14,IF($I$3=$M$5,'SP Welded'!C14,\"\")))","v":43.5}]
[{"$f":"IF($I$3=$M$3,'SP Plus Bolted'!A15,IF($I$3=$M$4,'SP Bolted'!A15,IF($I$3=$M$5,'SP Welded'!A15,\"\")))","v":"W40X277"},{"$f":"IF($I$3=$M$3,'SP Plus Bolted'!B15,IF($I$3=$M$4,'SP Bolted'!B15,IF($I$3=$M$5,'SP Welded'!B15,\"\")))","v":34},{"$f":"IF($I$3=$M$3,'SP Plus Bolted'!C15,IF($I$3=$M$4,'SP Bolted'!C15,IF($I$3=$M$5,'SP Welded'!C15,\"\")))","v":43.5}]
[{"$f":"IF($I$3=$M$3,'SP Plus Bolted'!A16,IF($I$3=$M$4,'SP Bolted'!A16,IF($I$3=$M$5,'SP Welded'!A16,\"\")))","v":"W40X249"},{"$f":"IF($I$3=$M$3,'SP Plus Bolted'!B16,IF($I$3=$M$4,'SP Bolted'!B16,IF($I$3=$M$5,'SP Welded'!B16,\"\")))","v":34},{"$f":"IF($I$3=$M$3,'SP Plus Bolted'!C16,IF($I$3=$M$4,'SP Bolted'!C16,IF($I$3=$M$5,'SP Welded'!C16,\"\")))","v":43}]
[{"$f":"IF($I$3=$M$3,'SP Plus Bolted'!A17,IF($I$3=$M$4,'SP Bolted'!A17,IF($I$3=$M$5,'SP Welded'!A17,\"\")))","v":"W40X215"},{"$f":"IF($I$3=$M$3,'SP Plus Bolted'!B17,IF($I$3=$M$4,'SP Bolted'!B17,IF($I$3=$M$5,'SP Welded'!B17,\"\")))","v":34},{"$f":"IF($I$3=$M$3,'SP Plus Bolted'!C17,IF($I$3=$M$4,'SP Bolted'!C17,IF($I$3=$M$5,'SP Welded'!C17,\"\")))","v":42.5}]
[{"$f":"IF($I$3=$M$3,'SP Plus Bolted'!A18,IF($I$3=$M$4,'SP Bolted'!A18,IF($I$3=$M$5,'SP Welded'!A18,\"\")))","v":"W40X199"},{"$f":"IF($I$3=$M$3,'SP Plus Bolted'!B18,IF($I$3=$M$4,'SP Bolted'!B18,IF($I$3=$M$5,'SP Welded'!B18,\"\")))","v":33},{"$f":"IF($I$3=$M$3,'SP Plus Bolted'!C18,IF($I$3=$M$4,'SP Bolted'!C18,IF($I$3=$M$5,'SP Welded'!C18,\"\")))","v":42.5}]
[{"$f":"IF($I$3=$M$3,'SP Plus Bolted'!A19,IF($I$3=$M$4,'SP Bolted'!A19,IF($I$3=$M$5,'SP Welded'!A19,\"\")))","v":"W40X392"},{"$f":"IF($I$3=$M$3,'SP Plus Bolted'!B19,IF($I$3=$M$4,'SP Bolted'!B19,IF($I$3=$M$5,'SP Welded'!B19,\"\")))","v":36},{"$f":"IF($I$3=$M$3,'SP Plus Bolted'!C19,IF($I$3=$M$4,'SP Bolted'!C19,IF($I$3=$M$5,'SP Welded'!C19,\"\")))","v":45.5}]
[{"$f":"IF($I$3=$M$3,'SP Plus Bolted'!A20,IF($I$3=$M$4,'SP Bolted'!A20,IF($I$3=$M$5,'SP Welded'!A20,\"\")))","v":"W40X331"},{"$f":"IF($I$3=$M$3,'SP Plus Bolted'!B20,IF($I$3=$M$4,'SP Bolted'!B20,IF($I$3=$M$5,'SP Welded'!B20,\"\")))","v":35},{"$f":"IF($I$3=$M$3,'SP Plus Bolted'!C20,IF($I$3=$M$4,'SP Bolted'!C20,IF($I$3=$M$5,'SP Welded'!C20,\"\")))","v":44.5}]
[{"$f":"IF($I$3=$M$3,'SP Plus Bolted'!A21,IF($I$3=$M$4,'SP Bolted'!A21,IF($I$3=$M$5,'SP Welded'!A21,\"\")))","v":"W40X327"},{"$f":"IF($I$3=$M$3,'SP Plus Bolted'!B21,IF($I$3=$M$4,'SP Bolted'!B21,IF($I$3=$M$5,'SP Welded'!B21,\"\")))","v":35},{"$f":"IF($I$3=$M$3,'SP Plus Bolted'!C21,IF($I$3=$M$4,'SP Bolted'!C21,IF($I$3=$M$5,'SP Welded'!C21,\"\")))","v":44.5}]
[{"$f":"IF($I$3=$M$3,'SP Plus Bolted'!A22,IF($I$3=$M$4,'SP Bolted'!A22,IF($I$3=$M$5,'SP Welded'!A22,\"\")))","v":"W40X294"},{"$f":"IF($I$3=$M$3,'SP Plus Bolted'!B22,IF($I$3=$M$4,'SP Bolted'!B22,IF($I$3=$M$5,'SP Welded'!B22,\"\")))","v":35},{"$f":"IF($I$3=$M$3,'SP Plus Bolted'!C22,IF($I$3=$M$4,'SP Bolted'!C22,IF($I$3=$M$5,'SP Welded'!C22,\"\")))","v":44}]
[{"$f":"IF($I$3=$M$3,'SP Plus Bolted'!A23,IF($I$3=$M$4,'SP Bolted'!A23,IF($I$3=$M$5,'SP Welded'!A23,\"\")))","v":"W40X278"},{"$f":"IF($I$3=$M$3,'SP Plus Bolted'!B23,IF($I$3=$M$4,'SP Bolted'!B23,IF($I$3=$M$5,'SP Welded'!B23,\"\")))","v":35},{"$f":"IF($I$3=$M$3,'SP Plus Bolted'!C23,IF($I$3=$M$4,'SP Bolted'!C23,IF($I$3=$M$5,'SP Welded'!C23,\"\")))","v":44}]
[{"$f":"IF($I$3=$M$3,'SP Plus Bolted'!A24,IF($I$3=$M$4,'SP Bolted'!A24,IF($I$3=$M$5,'SP Welded'!A24,\"\")))","v":"W40X264"},{"$f":"IF($I$3=$M$3,'SP Plus Bolted'!B24,IF($I$3=$M$4,'SP Bolted'!B24,IF($I$3=$M$5,'SP Welded'!B24,\"\")))","v":34},{"$f":"IF($I$3=$M$3,'SP Plus Bolted'!C24,IF($I$3=$M$4,'SP Bolted'!C24,IF($I$3=$M$5,'SP Welded'!C24,\"\")))","v":43.5}]
[{"$f":"IF($I$3=$M$3,'SP Plus Bolted'!A25,IF($I$3=$M$4,'SP Bolted'!A25,IF($I$3=$M$5,'SP Welded'!A25,\"\")))","v":"W40X235"},{"$f":"IF($I$3=$M$3,'SP Plus Bolted'!B25,IF($I$3=$M$4,'SP Bolted'!B25,IF($I$3=$M$5,'SP Welded'!B25,\"\")))","v":34},{"$f":"IF($I$3=$M$3,'SP Plus Bolted'!C25,IF($I$3=$M$4,'SP Bolted'!C25,IF($I$3=$M$5,'SP Welded'!C25,\"\")))","v":43.5}]
[{"$f":"IF($I$3=$M$3,'SP Plus Bolted'!A26,IF($I$3=$M$4,'SP Bolted'!A26,IF($I$3=$M$5,'SP Welded'!A26,\"\")))","v":"W40X211"},{"$f":"IF($I$3=$M$3,'SP Plus Bolted'!B26,IF($I$3=$M$4,'SP Bolted'!B26,IF($I$3=$M$5,'SP Welded'!B26,\"\")))","v":34},{"$f":"IF($I$3=$M$3,'SP Plus Bolted'!C26,IF($I$3=$M$4,'SP Bolted'!C26,IF($I$3=$M$5,'SP Welded'!C26,\"\")))","v":43}]
[{"$f":"IF($I$3=$M$3,'SP Plus Bolted'!A27,IF($I$3=$M$4,'SP Bolted'!A27,IF($I$3=$M$5,'SP Welded'!A27,\"\")))","v":"W40X183"},{"$f":"IF($I$3=$M$3,'SP Plus Bolted'!B27,IF($I$3=$M$4,'SP Bolted'!B27,IF($I$3=$M$5,'SP Welded'!B27,\"\")))","v":34},{"$f":"IF($I$3=$M$3,'SP Plus Bolted'!C27,IF($I$3=$M$4,'SP Bolted'!C27,IF($I$3=$M$5,'SP Welded'!C27,\"\")))","v":42.5}]
[{"$f":"IF($I$3=$M$3,'SP Plus Bolted'!A28,IF($I$3=$M$4,'SP Bolted'!A28,IF($I$3=$M$5,'SP Welded'!A28,\"\")))","v":"W40X167"},{"$f":"IF($I$3=$M$3,'SP Plus Bolted'!B28,IF($I$3=$M$4,'SP Bolted'!B28,IF($I$3=$M$5,'SP Welded'!B28,\"\")))","v":33},{"$f":"IF($I$3=$M$3,'SP Plus Bolted'!C28,IF($I$3=$M$4,'SP Bolted'!C28,IF($I$3=$M$5,'SP Welded'!C28,\"\")))","v":42.5}]
[{"$f":"IF($I$3=$M$3,'SP Plus Bolted'!A29,IF($I$3=$M$4,'SP Bolted'!A29,IF($I$3=$M$5,'SP Welded'!A29,\"\")))","v":"W40X149"},{"$f":"IF($I$3=$M$3,'SP Plus Bolted'!B29,IF($I$3=$M$4,'SP Bolted'!B29,IF($I$3=$M$5,'SP Welded'!B29,\"\")))","v":33},{"$f":"IF($I$3=$M$3,'SP Plus Bolted'!C29,IF($I$3=$M$4,'SP Bolted'!C29,IF($I$3=$M$5,'SP Welded'!C29,\"\")))","v":42}]
[{"$f":"IF($I$3=$M$3,'SP Plus Bolted'!A30,IF($I$3=$M$4,'SP Bolted'!A30,IF($I$3=$M$5,'SP Welded'!A30,\"\")))","v":"W36X925"},{"$f":"IF($I$3=$M$3,'SP Plus Bolted'!B30,IF($I$3=$M$4,'SP Bolted'!B30,IF($I$3=$M$5,'SP Welded'!B30,\"\")))","v":37},{"$f":"IF($I$3=$M$3,'SP Plus Bolted'!C30,IF($I$3=$M$4,'SP Bolted'!C30,IF($I$3=$M$5,'SP Welded'!C30,\"\")))","v":47}]
[{"$f":"IF($I$3=$M$3,'SP Plus Bolted'!A31,IF($I$3=$M$4,'SP Bolted'!A31,IF($I$3=$M$5,'SP Welded'!A31,\"\")))","v":"W36X853"},{"$f":"IF($I$3=$M$3,'SP Plus Bolted'!B31,IF($I$3=$M$4,'SP Bolted'!B31,IF($I$3=$M$5,'SP Welded'!B31,\"\")))","v":37},{"$f":"IF($I$3=$M$3,'SP Plus Bolted'!C31,IF($I$3=$M$4,'SP Bolted'!C31,IF($I$3=$M$5,'SP Welded'!C31,\"\")))","v":47}]
[{"$f":"IF($I$3=$M$3,'SP Plus Bolted'!A32,IF($I$3=$M$4,'SP Bolted'!A32,IF($I$3=$M$5,'SP Welded'!A32,\"\")))","v":"W36X802"},{"$f":"IF($I$3=$M$3,'SP Plus Bolted'!B32,IF($I$3=$M$4,'SP Bolted'!B32,IF($I$3=$M$5,'SP Welded'!B32,\"\")))","v":37},{"$f":"IF($I$3=$M$3,'SP Plus Bolted'!C32,IF($I$3=$M$4,'SP Bolted'!C32,IF($I$3=$M$5,'SP Welded'!C32,\"\")))","v":46.5}]
[{"$f":"IF($I$3=$M$3,'SP Plus Bolted'!A33,IF($I$3=$M$4,'SP Bolted'!A33,IF($I$3=$M$5,'SP Welded'!A33,\"\")))","v":"W36X723"},{"$f":"IF($I$3=$M$3,'SP Plus Bolted'!B33,IF($I$3=$M$4,'SP Bolted'!B33,IF($I$3=$M$5,'SP Welded'!B33,\"\")))","v":36},{"$f":"IF($I$3=$M$3,'SP Plus Bolted'!C33,IF($I$3=$M$4,'SP Bolted'!C33,IF($I$3=$M$5,'SP Welded'!C33,\"\")))","v":45.5}]
[{"$f":"IF($I$3=$M$3,'SP Plus Bolted'!A34,IF($I$3=$M$4,'SP Bolted'!A34,IF($I$3=$M$5,'SP Welded'!A34,\"\")))","v":"W36X652"},{"$f":"IF($I$3=$M$3,'SP Plus Bolted'!B34,IF($I$3=$M$4,'SP Bolted'!B34,IF($I$3=$M$5,'SP Welded'!B34,\"\")))","v":35},{"$f":"IF($I$3=$M$3,'SP Plus Bolted'!C34,IF($I$3=$M$4,'SP Bolted'!C34,IF($I$3=$M$5,'SP Welded'!C34,\"\")))","v":44.5}]
[{"$f":"IF($I$3=$M$3,'SP Plus Bolted'!A35,IF($I$3=$M$4,'SP Bolted'!A35,IF($I$3=$M$5,'SP Welded'!A35,\"\")))","v":"W36X529"},{"$f":"IF($I$3=$M$3,'SP Plus Bolted'!B35,IF($I$3=$M$4,'SP Bolted'!B35,IF($I$3=$M$5,'SP Welded'!B35,\"\")))","v":34},{"$f":"IF($I$3=$M$3,'SP Plus Bolted'!C35,IF($I$3=$M$4,'SP Bolted'!C35,IF($I$3=$M$5,'SP Welded'!C35,\"\")))","v":43.5}]
[{"$f":"IF($I$3=$M$3,'SP Plus Bolted'!A36,IF($I$3=$M$4,'SP Bolted'!A36,IF($I$3=$M$5,'SP Welded'!A36,\"\")))","v":"W36X487"},{"$f":"IF($I$3=$M$3,'SP Plus Bolted'!B36,IF($I$3=$M$4,'SP Bolted'!B36,IF($I$3=$M$5,'SP Welded'!B36,\"\")))","v":34},{"$f":"IF($I$3=$M$3,'SP Plus Bolted'!C36,IF($I$3=$M$4,'SP Bolted'!C36,IF($I$3=$M$5,'SP Welded'!C36,\"\")))","v":43}]
[{"$f":"IF($I$3=$M$3,'SP Plus Bolted'!A37,IF($I$3=$M$4,'SP Bolted'!A37,IF($I$3=$M$5,'SP Welded'!A37,\"\")))","v":"W36X441"},{"$f":"IF($I$3=$M$3,'SP Plus Bolted'!B37,IF($I$3=$M$4,'SP Bolted'!B37,IF($I$3=$M$5,'SP Welded'!B37,\"\")))","v":34},{"$f":"IF($I$3=$M$3,'SP Plus Bolted'!C37,IF($I$3=$M$4,'SP Bolted'!C37,IF($I$3=$M$5,'SP Welded'!C37,\"\")))","v":42.5}]
[{"$f":"IF($I$3=$M$3,'SP Plus Bolted'!A38,IF($I$3=$M$4,'SP Bolted'!A38,IF($I$3=$M$5,'SP Welded'!A38,\"\")))","v":"W36X395"},{"$f":"IF($I$3=$M$3,'SP Plus Bolted'!B38,IF($I$3=$M$4,'SP Bolted'!B38,IF($I$3=$M$5,'SP Welded'!B38,\"\")))","v":33},{"$f":"IF($I$3=$M$3,'SP Plus Bolted'!C38,IF($I$3=$M$4,'SP Bolted'!C38,IF($I$3=$M$5,'SP Welded'!C38,\"\")))","v":42}]
[{"$f":"IF($I$3=$M$3,'SP Plus Bolted'!A39,IF($I$3=$M$4,'SP Bolted'!A39,IF($I$3=$M$5,'SP Welded'!A39,\"\")))","v":"W36X361"},{"$f":"IF($I$3=$M$3,'SP Plus Bolted'!B39,IF($I$3=$M$4,'SP Bolted'!B39,IF($I$3=$M$5,'SP Welded'!B39,\"\")))","v":33},{"$f":"IF($I$3=$M$3,'SP Plus Bolted'!C39,IF($I$3=$M$4,'SP Bolted'!C39,IF($I$3=$M$5,'SP Welded'!C39,\"\")))","v":41.5}]
[{"$f":"IF($I$3=$M$3,'SP Plus Bolted'!A40,IF($I$3=$M$4,'SP Bolted'!A40,IF($I$3=$M$5,'SP Welded'!A40,\"\")))","v":"W36X330"},{"$f":"IF($I$3=$M$3,'SP Plus Bolted'!B40,IF($I$3=$M$4,'SP Bolted'!B40,IF($I$3=$M$5,'SP Welded'!B40,\"\")))","v":32},{"$f":"IF($I$3=$M$3,'SP Plus Bolted'!C40,IF($I$3=$M$4,'SP Bolted'!C40,IF($I$3=$M$5,'SP Welded'!C40,\"\")))","v":41.5}]
[{"$f":"IF($I$3=$M$3,'SP Plus Bolted'!A41,IF($I$3=$M$4,'SP Bolted'!A41,IF($I$3=$M$5,'SP Welded'!A41,\"\")))","v":"W36X302"},{"$f":"IF($I$3=$M$3,'SP Plus Bolted'!B41,IF($I$3=$M$4,'SP Bolted'!B41,IF($I$3=$M$5,'SP Welded'!B41,\"\")))","v":32},{"$f":"IF($I$3=$M$3,'SP Plus Bolted'!C41,IF($I$3=$M$4,'SP Bolted'!C41,IF($I$3=$M$5,'SP Welded'!C41,\"\")))","v":41}]
[{"$f":"IF($I$3=$M$3,'SP Plus Bolted'!A42,IF($I$3=$M$4,'SP Bolted'!A42,IF($I$3=$M$5,'SP Welded'!A42,\"\")))","v":"W36X282"},{"$f":"IF($I$3=$M$3,'SP Plus Bolted'!B42,IF($I$3=$M$4,'SP Bolted'!B42,IF($I$3=$M$5,'SP Welded'!B42,\"\")))","v":32},{"$f":"IF($I$3=$M$3,'SP Plus Bolted'!C42,IF($I$3=$M$4,'SP Bolted'!C42,IF($I$3=$M$5,'SP Welded'!C42,\"\")))","v":41}]
[{"$f":"IF($I$3=$M$3,'SP Plus Bolted'!A43,IF($I$3=$M$4,'SP Bolted'!A43,IF($I$3=$M$5,'SP Welded'!A43,\"\")))","v":"W36X262"},{"$f":"IF($I$3=$M$3,'SP Plus Bolted'!B43,IF($I$3=$M$4,'SP Bolted'!B43,IF($I$3=$M$5,'SP Welded'!B43,\"\")))","v":32},{"$f":"IF($I$3=$M$3,'SP Plus Bolted'!C43,IF($I$3=$M$4,'SP Bolted'!C43,IF($I$3=$M$5,'SP Welded'!C43,\"\")))","v":40.5}]
[{"$f":"IF($I$3=$M$3,'SP Plus Bolted'!A44,IF($I$3=$M$4,'SP Bolted'!A44,IF($I$3=$M$5,'SP Welded'!A44,\"\")))","v":"W36X247"},{"$f":"IF($I$3=$M$3,'SP Plus Bolted'!B44,IF($I$3=$M$4,'SP Bolted'!B44,IF($I$3=$M$5,'SP Welded'!B44,\"\")))","v":32},{"$f":"IF($I$3=$M$3,'SP Plus Bolted'!C44,IF($I$3=$M$4,'SP Bolted'!C44,IF($I$3=$M$5,'SP Welded'!C44,\"\")))","v":40.5}]
[{"$f":"IF($I$3=$M$3,'SP Plus Bolted'!A45,IF($I$3=$M$4,'SP Bolted'!A45,IF($I$3=$M$5,'SP Welded'!A45,\"\")))","v":"W36X231"},{"$f":"IF($I$3=$M$3,'SP Plus Bolted'!B45,IF($I$3=$M$4,'SP Bolted'!B45,IF($I$3=$M$5,'SP Welded'!B45,\"\")))","v":32},{"$f":"IF($I$3=$M$3,'SP Plus Bolted'!C45,IF($I$3=$M$4,'SP Bolted'!C45,IF($I$3=$M$5,'SP Welded'!C45,\"\")))","v":40}]
[{"$f":"IF($I$3=$M$3,'SP Plus Bolted'!A46,IF($I$3=$M$4,'SP Bolted'!A46,IF($I$3=$M$5,'SP Welded'!A46,\"\")))","v":"W36X256"},{"$f":"IF($I$3=$M$3,'SP Plus Bolted'!B46,IF($I$3=$M$4,'SP Bolted'!B46,IF($I$3=$M$5,'SP Welded'!B46,\"\")))","v":32},{"$f":"IF($I$3=$M$3,'SP Plus Bolted'!C46,IF($I$3=$M$4,'SP Bolted'!C46,IF($I$3=$M$5,'SP Welded'!C46,\"\")))","v":41}]
[{"$f":"IF($I$3=$M$3,'SP Plus Bolted'!A47,IF($I$3=$M$4,'SP Bolted'!A47,IF($I$3=$M$5,'SP Welded'!A47,\"\")))","v":"W36X232"},{"$f":"IF($I$3=$M$3,'SP Plus Bolted'!B47,IF($I$3=$M$4,'SP Bolted'!B47,IF($I$3=$M$5,'SP Welded'!B47,\"\")))","v":32},{"$f":"IF($I$3=$M$3,'SP Plus Bolted'!C47,IF($I$3=$M$4,'SP Bolted'!C47,IF($I$3=$M$5,'SP Welded'!C47,\"\")))","v":41}]
[{"$f":"IF($I$3=$M$3,'SP Plus Bolted'!A48,IF($I$3=$M$4,'SP Bolted'!A48,IF($I$3=$M$5,'SP Welded'!A48,\"\")))","v":"W36X210"},{"$f":"IF($I$3=$M$3,'SP Plus Bolted'!B48,IF($I$3=$M$4,'SP Bolted'!B48,IF($I$3=$M$5,'SP Welded'!B48,\"\")))","v":32},{"$f":"IF($I$3=$M$3,'SP Plus Bolted'!C48,IF($I$3=$M$4,'SP Bolted'!C48,IF($I$3=$M$5,'SP Welded'!C48,\"\")))","v":40.5}]
[{"$f":"IF($I$3=$M$3,'SP Plus Bolted'!A49,IF($I$3=$M$4,'SP Bolted'!A49,IF($I$3=$M$5,'SP Welded'!A49,\"\")))","v":"W36X194"},{"$f":"IF($I$3=$M$3,'SP Plus Bolted'!B49,IF($I$3=$M$4,'SP Bolted'!B49,IF($I$3=$M$5,'SP Welded'!B49,\"\")))","v":32},{"$f":"IF($I$3=$M$3,'SP Plus Bolted'!C49,IF($I$3=$M$4,'SP Bolted'!C49,IF($I$3=$M$5,'SP Welded'!C49,\"\")))","v":40}]
[{"$f":"IF($I$3=$M$3,'SP Plus Bolted'!A50,IF($I$3=$M$4,'SP Bolted'!A50,IF($I$3=$M$5,'SP Welded'!A50,\"\")))","v":"W36X182"},{"$f":"IF($I$3=$M$3,'SP Plus Bolted'!B50,IF($I$3=$M$4,'SP Bolted'!B50,IF($I$3=$M$5,'SP Welded'!B50,\"\")))","v":31},{"$f":"IF($I$3=$M$3,'SP Plus Bolted'!C50,IF($I$3=$M$4,'SP Bolted'!C50,IF($I$3=$M$5,'SP Welded'!C50,\"\")))","v":40}]
[{"$f":"IF($I$3=$M$3,'SP Plus Bolted'!A51,IF($I$3=$M$4,'SP Bolted'!A51,IF($I$3=$M$5,'SP Welded'!A51,\"\")))","v":"W36X170"},{"$f":"IF($I$3=$M$3,'SP Plus Bolted'!B51,IF($I$3=$M$4,'SP Bolted'!B51,IF($I$3=$M$5,'SP Welded'!B51,\"\")))","v":31},{"$f":"IF($I$3=$M$3,'SP Plus Bolted'!C51,IF($I$3=$M$4,'SP Bolted'!C51,IF($I$3=$M$5,'SP Welded'!C51,\"\")))","v":40}]
[{"$f":"IF($I$3=$M$3,'SP Plus Bolted'!A52,IF($I$3=$M$4,'SP Bolted'!A52,IF($I$3=$M$5,'SP Welded'!A52,\"\")))","v":"W36X160"},{"$f":"IF($I$3=$M$3,'SP Plus Bolted'!B52,IF($I$3=$M$4,'SP Bolted'!B52,IF($I$3=$M$5,'SP Welded'!B52,\"\")))","v":31},{"$f":"IF($I$3=$M$3,'SP Plus Bolted'!C52,IF($I$3=$M$4,'SP Bolted'!C52,IF($I$3=$M$5,'SP Welded'!C52,\"\")))","v":39.5}]
[{"$f":"IF($I$3=$M$3,'SP Plus Bolted'!A53,IF($I$3=$M$4,'SP Bolted'!A53,IF($I$3=$M$5,'SP Welded'!A53,\"\")))","v":"W36X150"},{"$f":"IF($I$3=$M$3,'SP Plus Bolted'!B53,IF($I$3=$M$4,'SP Bolted'!B53,IF($I$3=$M$5,'SP Welded'!B53,\"\")))","v":31},{"$f":"IF($I$3=$M$3,'SP Plus Bolted'!C53,IF($I$3=$M$4,'SP Bolted'!C53,IF($I$3=$M$5,'SP Welded'!C53,\"\")))","v":39.5}]
[{"$f":"IF($I$3=$M$3,'SP Plus Bolted'!A54,IF($I$3=$M$4,'SP Bolted'!A54,IF($I$3=$M$5,'SP Welded'!A54,\"\")))","v":"W36X135"},{"$f":"IF($I$3=$M$3,'SP Plus Bolted'!B54,IF($I$3=$M$4,'SP Bolted'!B54,IF($I$3=$M$5,'SP Welded'!B54,\"\")))","v":31},{"$f":"IF($I$3=$M$3,'SP Plus Bolted'!C54,IF($I$3=$M$4,'SP Bolted'!C54,IF($I$3=$M$5,'SP Welded'!C54,\"\")))","v":39}]
[{"$f":"IF($I$3=$M$3,'SP Plus Bolted'!A55,IF($I$3=$M$4,'SP Bolted'!A55,IF($I$3=$M$5,'SP Welded'!A55,\"\")))","v":"W33X387"},{"$f":"IF($I$3=$M$3,'SP Plus Bolted'!B55,IF($I$3=$M$4,'SP Bolted'!B55,IF($I$3=$M$5,'SP Welded'!B55,\"\")))","v":31},{"$f":"IF($I$3=$M$3,'SP Plus Bolted'!C55,IF($I$3=$M$4,'SP Bolted'!C55,IF($I$3=$M$5,'SP Welded'!C55,\"\")))","v":39.5}]
[{"$f":"IF($I$3=$M$3,'SP Plus Bolted'!A56,IF($I$3=$M$4,'SP Bolted'!A56,IF($I$3=$M$5,'SP Welded'!A56,\"\")))","v":"W33X354"},{"$f":"IF($I$3=$M$3,'SP Plus Bolted'!B56,IF($I$3=$M$4,'SP Bolted'!B56,IF($I$3=$M$5,'SP Welded'!B56,\"\")))","v":31},{"$f":"IF($I$3=$M$3,'SP Plus Bolted'!C56,IF($I$3=$M$4,'SP Bolted'!C56,IF($I$3=$M$5,'SP Welded'!C56,\"\")))","v":39}]
[{"$f":"IF($I$3=$M$3,'SP Plus Bolted'!A57,IF($I$3=$M$4,'SP Bolted'!A57,IF($I$3=$M$5,'SP Welded'!A57,\"\")))","v":"W33X318"},{"$f":"IF($I$3=$M$3,'SP Plus Bolted'!B57,IF($I$3=$M$4,'SP Bolted'!B57,IF($I$3=$M$5,'SP Welded'!B57,\"\")))","v":30},{"$f":"IF($I$3=$M$3,'SP Plus Bolted'!C57,IF($I$3=$M$4,'SP Bolted'!C57,IF($I$3=$M$5,'SP Welded'!C57,\"\")))","v":39}]
[{"$f":"IF($I$3=$M$3,'SP Plus Bolted'!A58,IF($I$3=$M$4,'SP Bolted'!A58,IF($I$3=$M$5,'SP Welded'!A58,\"\")))","v":"W33X291"},{"$f":"IF($I$3=$M$3,'SP Plus Bolted'!B58,IF($I$3=$M$4,'SP Bolted'!B58,IF($I$3=$M$5,'SP Welded'!B58,\"\")))","v":30},{"$f":"IF($I$3=$M$3,'SP Plus Bolted'!C58,IF($I$3=$M$4,'SP Bolted'!C58,IF($I$3=$M$5,'SP Welded'!C58,\"\")))","v":38.5}]
[{"$f":"IF($I$3=$M$3,'SP Plus Bolted'!A59,IF($I$3=$M$4,'SP Bolted'!A59,IF($I$3=$M$5,'SP Welded'!A59,\"\")))","v":"W33X263"},{"$f":"IF($I$3=$M$3,'SP Plus Bolted'!B59,IF($I$3=$M$4,'SP Bolted'!B59,IF($I$3=$M$5,'SP Welded'!B59,\"\")))","v":30},{"$f":"IF($I$3=$M$3,'SP Plus Bolted'!C59,IF($I$3=$M$4,'SP Bolted'!C59,IF($I$3=$M$5,'SP Welded'!C59,\"\")))","v":38}]
[{"$f":"IF($I$3=$M$3,'SP Plus Bolted'!A60,IF($I$3=$M$4,'SP Bolted'!A60,IF($I$3=$M$5,'SP Welded'!A60,\"\")))","v":"W33X241"},{"$f":"IF($I$3=$M$3,'SP Plus Bolted'!B60,IF($I$3=$M$4,'SP Bolted'!B60,IF($I$3=$M$5,'SP Welded'!B60,\"\")))","v":30},{"$f":"IF($I$3=$M$3,'SP Plus Bolted'!C60,IF($I$3=$M$4,'SP Bolted'!C60,IF($I$3=$M$5,'SP Welded'!C60,\"\")))","v":38}]
[{"$f":"IF($I$3=$M$3,'SP Plus Bolted'!A61,IF($I$3=$M$4,'SP Bolted'!A61,IF($I$3=$M$5,'SP Welded'!A61,\"\")))","v":"W33X221"},{"$f":"IF($I$3=$M$3,'SP Plus Bolted'!B61,IF($I$3=$M$4,'SP Bolted'!B61,IF($I$3=$M$5,'SP Welded'!B61,\"\")))","v":29},{"$f":"IF($I$3=$M$3,'SP Plus Bolted'!C61,IF($I$3=$M$4,'SP Bolted'!C61,IF($I$3=$M$5,'SP Welded'!C61,\"\")))","v":37.5}]
[{"$f":"IF($I$3=$M$3,'SP Plus Bolted'!A62,IF($I$3=$M$4,'SP Bolted'!A62,IF($I$3=$M$5,'SP Welded'!A62,\"\")))","v":"W33X201"},{"$f":"IF($I$3=$M$3,'SP Plus Bolted'!B62,IF($I$3=$M$4,'SP Bolted'!B62,IF($I$3=$M$5,'SP Welded'!B62,\"\")))","v":29},{"$f":"IF($I$3=$M$3,'SP Plus Bolted'!C62,IF($I$3=$M$4,'SP Bolted'!C62,IF($I$3=$M$5,'SP Welded'!C62,\"\")))","v":37.5}]
[{"$f":"IF($I$3=$M$3,'SP Plus Bolted'!A63,IF($I$3=$M$4,'SP Bolted'!A63,IF($I$3=$M$5,'SP Welded'!A63,\"\")))","v":"W33X169"},{"$f":"IF($I$3=$M$3,'SP Plus Bolted'!B63,IF($I$3=$M$4,'SP Bolted'!B63,IF($I$3=$M$5,'SP Welded'!B63,\"\")))","v":29},{"$f":"IF($I$3=$M$3,'SP Plus Bolted'!C63,IF($I$3=$M$4,'SP Bolted'!C63,IF($I$3=$M$5,'SP Welded'!C63,\"\")))","v":37.5}]
[{"$f":"IF($I$3=$M$3,'SP Plus Bolted'!A64,IF($I$3=$M$4,'SP Bolted'!A64,IF($I$3=$M$5,'SP Welded'!A64,\"\")))","v":"W33X152"},{"$f":"IF($I$3=$M$3,'SP Plus Bolted'!B64,IF($I$3=$M$4,'SP Bolted'!B64,IF($I$3=$M$5,'SP Welded'!B64,\"\")))","v":29},{"$f":"IF($I$3=$M$3,'SP Plus Bolted'!C64,IF($I$3=$M$4,'SP Bolted'!C64,IF($I$3=$M$5,'SP Welded'!C64,\"\")))","v":37}]
[{"$f":"IF($I$3=$M$3,'SP Plus Bolted'!A65,IF($I$3=$M$4,'SP Bolted'!A65,IF($I$3=$M$5,'SP Welded'!A65,\"\")))","v":"W33X141"},{"$f":"IF($I$3=$M$3,'SP Plus Bolted'!B65,IF($I$3=$M$4,'SP Bolted'!B65,IF($I$3=$M$5,'SP Welded'!B65,\"\")))","v":29},{"$f":"IF($I$3=$M$3,'SP Plus Bolted'!C65,IF($I$3=$M$4,'SP Bolted'!C65,IF($I$3=$M$5,'SP Welded'!C65,\"\")))","v":37}]
[{"$f":"IF($I$3=$M$3,'SP Plus Bolted'!A66,IF($I$3=$M$4,'SP Bolted'!A66,IF($I$3=$M$5,'SP Welded'!A66,\"\")))","v":"W33X130"},{"$f":"IF($I$3=$M$3,'SP Plus Bolted'!B66,IF($I$3=$M$4,'SP Bolted'!B66,IF($I$3=$M$5,'SP Welded'!B66,\"\")))","v":29},{"$f":"IF($I$3=$M$3,'SP Plus Bolted'!C66,IF($I$3=$M$4,'SP Bolted'!C66,IF($I$3=$M$5,'SP Welded'!C66,\"\")))","v":37}]
[{"$f":"IF($I$3=$M$3,'SP Plus Bolted'!A67,IF($I$3=$M$4,'SP Bolted'!A67,IF($I$3=$M$5,'SP Welded'!A67,\"\")))","v":"W33X118"},{"$f":"IF($I$3=$M$3,'SP Plus Bolted'!B67,IF($I$3=$M$4,'SP Bolted'!B67,IF($I$3=$M$5,'SP Welded'!B67,\"\")))","v":28},{"$f":"IF($I$3=$M$3,'SP Plus Bolted'!C67,IF($I$3=$M$4,'SP Bolted'!C67,IF($I$3=$M$5,'SP Welded'!C67,\"\")))","v":36.5}]
[{"$f":"IF($I$3=$M$3,'SP Plus Bolted'!A68,IF($I$3=$M$4,'SP Bolted'!A68,IF($I$3=$M$5,'SP Welded'!A68,\"\")))","v":"W30X391"},{"$f":"IF($I$3=$M$3,'SP Plus Bolted'!B68,IF($I$3=$M$4,'SP Bolted'!B68,IF($I$3=$M$5,'SP Welded'!B68,\"\")))","v":29},{"$f":"IF($I$3=$M$3,'SP Plus Bolted'!C68,IF($I$3=$M$4,'SP Bolted'!C68,IF($I$3=$M$5,'SP Welded'!C68,\"\")))","v":37}]
[{"$f":"IF($I$3=$M$3,'SP Plus Bolted'!A69,IF($I$3=$M$4,'SP Bolted'!A69,IF($I$3=$M$5,'SP Welded'!A69,\"\")))","v":"W30X357"},{"$f":"IF($I$3=$M$3,'SP Plus Bolted'!B69,IF($I$3=$M$4,'SP Bolted'!B69,IF($I$3=$M$5,'SP Welded'!B69,\"\")))","v":28},{"$f":"IF($I$3=$M$3,'SP Plus Bolted'!C69,IF($I$3=$M$4,'SP Bolted'!C69,IF($I$3=$M$5,'SP Welded'!C69,\"\")))","v":36.5}]
[{"$f":"IF($I$3=$M$3,'SP Plus Bolted'!A70,IF($I$3=$M$4,'SP Bolted'!A70,IF($I$3=$M$5,'SP Welded'!A70,\"\")))","v":"W30X326"},{"$f":"IF($I$3=$M$3,'SP Plus Bolted'!B70,IF($I$3=$M$4,'SP Bolted'!B70,IF($I$3=$M$5,'SP Welded'!B70,\"\")))","v":28},{"$f":"IF($I$3=$M$3,'SP Plus Bolted'!C70,IF($I$3=$M$4,'SP Bolted'!C70,IF($I$3=$M$5,'SP Welded'!C70,\"\")))","v":36}]
[{"$f":"IF($I$3=$M$3,'SP Plus Bolted'!A71,IF($I$3=$M$4,'SP Bolted'!A71,IF($I$3=$M$5,'SP Welded'!A71,\"\")))","v":"W30X292"},{"$f":"IF($I$3=$M$3,'SP Plus Bolted'!B71,IF($I$3=$M$4,'SP Bolted'!B71,IF($I$3=$M$5,'SP Welded'!B71,\"\")))","v":28},{"$f":"IF($I$3=$M$3,'SP Plus Bolted'!C71,IF($I$3=$M$4,'SP Bolted'!C71,IF($I$3=$M$5,'SP Welded'!C71,\"\")))","v":35.5}]
[{"$f":"IF($I$3=$M$3,'SP Plus Bolted'!A72,IF($I$3=$M$4,'SP Bolted'!A72,IF($I$3=$M$5,'SP Welded'!A72,\"\")))","v":"W30X261"},{"$f":"IF($I$3=$M$3,'SP Plus Bolted'!B72,IF($I$3=$M$4,'SP Bolted'!B72,IF($I$3=$M$5,'SP Welded'!B72,\"\")))","v":27},{"$f":"IF($I$3=$M$3,'SP Plus Bolted'!C72,IF($I$3=$M$4,'SP Bolted'!C72,IF($I$3=$M$5,'SP Welded'!C72,\"\")))","v":35.5}]
[{"$f":"IF($I$3=$M$3,'SP Plus Bolted'!A73,IF($I$3=$M$4,'SP Bolted'!A73,IF($I$3=$M$5,'SP Welded'!A73,\"\")))","v":"W30X235"},{"$f":"IF($I$3=$M$3,'SP Plus Bolted'!B73,IF($I$3=$M$4,'SP Bolted'!B73,IF($I$3=$M$5,'SP Welded'!B73,\"\")))","v":27},{"$f":"IF($I$3=$M$3,'SP Plus Bolted'!C73,IF($I$3=$M$4,'SP Bolted'!C73,IF($I$3=$M$5,'SP Welded'!C73,\"\")))","v":35}]
[{"$f":"IF($I$3=$M$3,'SP Plus Bolted'!A74,IF($I$3=$M$4,'SP Bolted'!A74,IF($I$3=$M$5,'SP Welded'!A74,\"\")))","v":"W30X211"},{"$f":"IF($I$3=$M$3,'SP Plus Bolted'!B74,IF($I$3=$M$4,'SP Bolted'!B74,IF($I$3=$M$5,'SP Welded'!B74,\"\")))","v":27},{"$f":"IF($I$3=$M$3,'SP Plus Bolted'!C74,IF($I$3=$M$4,'SP Bolted'!C74,IF($I$3=$M$5,'SP Welded'!C74,\"\")))","v":34.5}]
[{"$f":"IF($I$3=$M$3,'SP Plus Bolted'!A75,IF($I$3=$M$4,'SP Bolted'!A75,IF($I$3=$M$5,'SP Welded'!A75,\"\")))","v":"W30X191"},{"$f":"IF($I$3=$M$3,'SP Plus Bolted'!B75,IF($I$3=$M$4,'SP Bolted'!B75,IF($I$3=$M$5,'SP Welded'!B75,\"\")))","v":27},{"$f":"IF($I$3=$M$3,'SP Plus Bolted'!C75,IF($I$3=$M$4,'SP Bolted'!C75,IF($I$3=$M$5,'SP Welded'!C75,\"\")))","v":34.5}]
[{"$f":"IF($I$3=$M$3,'SP Plus Bolted'!A76,IF($I$3=$M$4,'SP Bolted'!A76,IF($I$3=$M$5,'SP Welded'!A76,\"\")))","v":"W30X173"},{"$f":"IF($I$3=$M$3,'SP Plus Bolted'!B76,IF($I$3=$M$4,'SP Bolted'!B76,IF($I$3=$M$5,'SP Welded'!B76,\"\")))","v":26},{"$f":"IF($I$3=$M$3,'SP Plus Bolted'!C76,IF($I$3=$M$4,'SP Bolted'!C76,IF($I$3=$M$5,'SP Welded'!C76,\"\")))","v":34}]
[{"$f":"IF($I$3=$M$3,'SP Plus Bolted'!A77,IF($I$3=$M$4,'SP Bolted'!A77,IF($I$3=$M$5,'SP Welded'!A77,\"\")))","v":"W30X148"},{"$f":"IF($I$3=$M$3,'SP Plus Bolted'!B77,IF($I$3=$M$4,'SP Bolted'!B77,IF($I$3=$M$5,'SP Welded'!B77,\"\")))","v":27},{"$f":"IF($I$3=$M$3,'SP Plus Bolted'!C77,IF($I$3=$M$4,'SP Bolted'!C77,IF($I$3=$M$5,'SP Welded'!C77,\"\")))","v":34.5}]
[{"$f":"IF($I$3=$M$3,'SP Plus Bolted'!A78,IF($I$3=$M$4,'SP Bolted'!A78,IF($I$3=$M$5,'SP Welded'!A78,\"\")))","v":"W30X132"},{"$f":"IF($I$3=$M$3,'SP Plus Bolted'!B78,IF($I$3=$M$4,'SP Bolted'!B78,IF($I$3=$M$5,'SP Welded'!B78,\"\")))","v":26},{"$f":"IF($I$3=$M$3,'SP Plus Bolted'!C78,IF($I$3=$M$4,'SP Bolted'!C78,IF($I$3=$M$5,'SP Welded'!C78,\"\")))","v":34}]
[{"$f":"IF($I$3=$M$3,'SP Plus Bolted'!A79,IF($I$3=$M$4,'SP Bolted'!A79,IF($I$3=$M$5,'SP Welded'!A79,\"\")))","v":"W30X124"},{"$f":"IF($I$3=$M$3,'SP Plus Bolted'!B79,IF($I$3=$M$4,'SP Bolted'!B79,IF($I$3=$M$5,'SP Welded'!B79,\"\")))","v":26},{"$f":"IF($I$3=$M$3,'SP Plus Bolted'!C79,IF($I$3=$M$4,'SP Bolted'!C79,IF($I$3=$M$5,'SP Welded'!C79,\"\")))","v":34}]
[{"$f":"IF($I$3=$M$3,'SP Plus Bolted'!A80,IF($I$3=$M$4,'SP Bolted'!A80,IF($I$3=$M$5,'SP Welded'!A80,\"\")))","v":"W30X116"},{"$f":"IF($I$3=$M$3,'SP Plus Bolted'!B80,IF($I$3=$M$4,'SP Bolted'!B80,IF($I$3=$M$5,'SP Welded'!B80,\"\")))","v":26},{"$f":"IF($I$3=$M$3,'SP Plus Bolted'!C80,IF($I$3=$M$4,'SP Bolted'!C80,IF($I$3=$M$5,'SP Welded'!C80,\"\")))","v":33.5}]
[{"$f":"IF($I$3=$M$3,'SP Plus Bolted'!A81,IF($I$3=$M$4,'SP Bolted'!A81,IF($I$3=$M$5,'SP Welded'!A81,\"\")))","v":"W30X108"},{"$f":"IF($I$3=$M$3,'SP Plus Bolted'!B81,IF($I$3=$M$4,'SP Bolted'!B81,IF($I$3=$M$5,'SP Welded'!B81,\"\")))","v":26},{"$f":"IF($I$3=$M$3,'SP Plus Bolted'!C81,IF($I$3=$M$4,'SP Bolted'!C81,IF($I$3=$M$5,'SP Welded'!C81,\"\")))","v":33.5}]
[{"$f":"IF($I$3=$M$3,'SP Plus Bolted'!A82,IF($I$3=$M$4,'SP Bolted'!A82,IF($I$3=$M$5,'SP Welded'!A82,\"\")))","v":"W30X99"},{"$f":"IF($I$3=$M$3,'SP Plus Bolted'!B82,IF($I$3=$M$4,'SP Bolted'!B82,IF($I$3=$M$5,'SP Welded'!B82,\"\")))","v":26},{"$f":"IF($I$3=$M$3,'SP Plus Bolted'!C82,IF($I$3=$M$4,'SP Bolted'!C82,IF($I$3=$M$5,'SP Welded'!C82,\"\")))","v":33.5}]
[{"$f":"IF($I$3=$M$3,'SP Plus Bolted'!A83,IF($I$3=$M$4,'SP Bolted'!A83,IF($I$3=$M$5,'SP Welded'!A83,\"\")))","v":"W30X90"},{"$f":"IF($I$3=$M$3,'SP Plus Bolted'!B83,IF($I$3=$M$4,'SP Bolted'!B83,IF($I$3=$M$5,'SP Welded'!B83,\"\")))","v":26},{"$f":"IF($I$3=$M$3,'SP Plus Bolted'!C83,IF($I$3=$M$4,'SP Bolted'!C83,IF($I$3=$M$5,'SP Welded'!C83,\"\")))","v":33}]
[{"$f":"IF($I$3=$M$3,'SP Plus Bolted'!A84,IF($I$3=$M$4,'SP Bolted'!A84,IF($I$3=$M$5,'SP Welded'!A84,\"\")))","v":"W27X539"},{"$f":"IF($I$3=$M$3,'SP Plus Bolted'!B84,IF($I$3=$M$4,'SP Bolted'!B84,IF($I$3=$M$5,'SP Welded'!B84,\"\")))","v":28},{"$f":"IF($I$3=$M$3,'SP Plus Bolted'!C84,IF($I$3=$M$4,'SP Bolted'!C84,IF($I$3=$M$5,'SP Welded'!C84,\"\")))","v":36}]
[{"$f":"IF($I$3=$M$3,'SP Plus Bolted'!A85,IF($I$3=$M$4,'SP Bolted'!A85,IF($I$3=$M$5,'SP Welded'!A85,\"\")))","v":"W27X368"},{"$f":"IF($I$3=$M$3,'SP Plus Bolted'!B85,IF($I$3=$M$4,'SP Bolted'!B85,IF($I$3=$M$5,'SP Welded'!B85,\"\")))","v":26},{"$f":"IF($I$3=$M$3,'SP Plus Bolted'!C85,IF($I$3=$M$4,'SP Bolted'!C85,IF($I$3=$M$5,'SP Welded'!C85,\"\")))","v":34}]
[{"$f":"IF($I$3=$M$3,'SP Plus Bolted'!A86,IF($I$3=$M$4,'SP Bolted'!A86,IF($I$3=$M$5,'SP Welded'!A86,\"\")))","v":"W27X336"},{"$f":"IF($I$3=$M$3,'SP Plus Bolted'!B86,IF($I$3=$M$4,'SP Bolted'!B86,IF($I$3=$M$5,'SP Welded'!B86,\"\")))","v":26},{"$f":"IF($I$3=$M$3,'SP Plus Bolted'!C86,IF($I$3=$M$4,'SP Bolted'!C86,IF($I$3=$M$5,'SP Welded'!C86,\"\")))","v":33.5}]
[{"$f":"IF($I$3=$M$3,'SP Plus Bolted'!A87,IF($I$3=$M$4,'SP Bolted'!A87,IF($I$3=$M$5,'SP Welded'!A87,\"\")))","v":"W27X307"},{"$f":"IF($I$3=$M$3,'SP Plus Bolted'!B87,IF($I$3=$M$4,'SP Bolted'!B87,IF($I$3=$M$5,'SP Welded'!B87,\"\")))","v":26},{"$f":"IF($I$3=$M$3,'SP Plus Bolted'!C87,IF($I$3=$M$4,'SP Bolted'!C87,IF($I$3=$M$5,'SP Welded'!C87,\"\")))","v":33.5}]
[{"$f":"IF($I$3=$M$3,'SP Plus Bolted'!A88,IF($I$3=$M$4,'SP Bolted'!A88,IF($I$3=$M$5,'SP Welded'!A88,\"\")))","v":"W27X281"},{"$f":"IF($I$3=$M$3,'SP Plus Bolted'!B88,IF($I$3=$M$4,'SP Bolted'!B88,IF($I$3=$M$5,'SP Welded'!B88,\"\")))","v":25},{"$f":"IF($I$3=$M$3,'SP Plus Bolted'!C88,IF($I$3=$M$4,'SP Bolted'!C88,IF($I$3=$M$5,'SP Welded'!C88,\"\")))","v":33}]
[{"$f":"IF($I$3=$M$3,'SP Plus Bolted'!A89,IF($I$3=$M$4,'SP Bolted'!A89,IF($I$3=$M$5,'SP Welded'!A89,\"\")))","v":"W27X258"},{"$f":"IF($I$3=$M$3,'SP Plus Bolted'!B89,IF($I$3=$M$4,'SP Bolted'!B89,IF($I$3=$M$5,'SP Welded'!B89,\"\")))","v":25},{"$f":"IF($I$3=$M$3,'SP Plus Bolted'!C89,IF($I$3=$M$4,'SP Bolted'!C89,IF($I$3=$M$5,'SP Welded'!C89,\"\")))","v":32.5}]
[{"$f":"IF($I$3=$M$3,'SP Plus Bolted'!A90,IF($I$3=$M$4,'SP Bolted'!A90,IF($I$3=$M$5,'SP Welded'!A90,\"\")))","v":"W27X235"},{"$f":"IF($I$3=$M$3,'SP Plus Bolted'!B90,IF($I$3=$M$4,'SP Bolted'!B90,IF($I$3=$M$5,'SP Welded'!B90,\"\")))","v":25},{"$f":"IF($I$3=$M$3,'SP Plus Bolted'!C90,IF($I$3=$M$4,'SP Bolted'!C90,IF($I$3=$M$5,'SP Welded'!C90,\"\")))","v":32.5}]
[{"$f":"IF($I$3=$M$3,'SP Plus Bolted'!A91,IF($I$3=$M$4,'SP Bolted'!A91,IF($I$3=$M$5,'SP Welded'!A91,\"\")))","v":"W27X217"},{"$f":"IF($I$3=$M$3,'SP Plus Bolted'!B91,IF($I$3=$M$4,'SP Bolted'!B91,IF($I$3=$M$5,'SP Welded'!B91,\"\")))","v":25},{"$f":"IF($I$3=$M$3,'SP Plus Bolted'!C91,IF($I$3=$M$4,'SP Bolted'!C91,IF($I$3=$M$5,'SP Welded'!C91,\"\")))","v":32}]
[{"$f":"IF($I$3=$M$3,'SP Plus Bolted'!A92,IF($I$3=$M$4,'SP Bolted'!A92,IF($I$3=$M$5,'SP Welded'!A92,\"\")))","v":"W27X194"},{"$f":"IF($I$3=$M$3,'SP Plus Bolted'!B92,IF($I$3=$M$4,'SP Bolted'!B92,IF($I$3=$M$5,'SP Welded'!B92,\"\")))","v":24},{"$f":"IF($I$3=$M$3,'SP Plus Bolted'!C92,IF($I$3=$M$4,'SP Bolted'!C92,IF($I$3=$M$5,'SP Welded'!C92,\"\")))","v":32}]
[{"$f":"IF($I$3=$M$3,'SP Plus Bolted'!A93,IF($I$3=$M$4,'SP Bolted'!A93,IF($I$3=$M$5,'SP Welded'!A93,\"\")))","v":"W27X178"},{"$f":"IF($I$3=$M$3,'SP Plus Bolted'!B93,IF($I$3=$M$4,'SP Bolted'!B93,IF($I$3=$M$5,'SP Welded'!B93,\"\")))","v":24},{"$f":"IF($I$3=$M$3,'SP Plus Bolted'!C93,IF($I$3=$M$4,'SP Bolted'!C93,IF($I$3=$M$5,'SP Welded'!C93,\"\")))","v":31.5}]
[{"$f":"IF($I$3=$M$3,'SP Plus Bolted'!A94,IF($I$3=$M$4,'SP Bolted'!A94,IF($I$3=$M$5,'SP Welded'!A94,\"\")))","v":"W27X161"},{"$f":"IF($I$3=$M$3,'SP Plus Bolted'!B94,IF($I$3=$M$4,'SP Bolted'!B94,IF($I$3=$M$5,'SP Welded'!B94,\"\")))","v":24},{"$f":"IF($I$3=$M$3,'SP Plus Bolted'!C94,IF($I$3=$M$4,'SP Bolted'!C94,IF($I$3=$M$5,'SP Welded'!C94,\"\")))","v":31.5}]
[{"$f":"IF($I$3=$M$3,'SP Plus Bolted'!A95,IF($I$3=$M$4,'SP Bolted'!A95,IF($I$3=$M$5,'SP Welded'!A95,\"\")))","v":"W27X146"},{"$f":"IF($I$3=$M$3,'SP Plus Bolted'!B95,IF($I$3=$M$4,'SP Bolted'!B95,IF($I$3=$M$5,'SP Welded'!B95,\"\")))","v":24},{"$f":"IF($I$3=$M$3,'SP Plus Bolted'!C95,IF($I$3=$M$4,'SP Bolted'!C95,IF($I$3=$M$5,'SP Welded'!C95,\"\")))","v":31}]
[{"$f":"IF($I$3=$M$3,'SP Plus Bolted'!A96,IF($I$3=$M$4,'SP Bolted'!A96,IF($I$3=$M$5,'SP Welded'!A96,\"\")))","v":"W27X129"},{"$f":"IF($I$3=$M$3,'SP Plus Bolted'!B96,IF($I$3=$M$4,'SP Bolted'!B96,IF($I$3=$M$5,'SP Welded'!B96,\"\")))","v":24},{"$f":"IF($I$3=$M$3,'SP Plus Bolted'!C96,IF($I$3=$M$4,'SP Bolted'!C96,IF($I$3=$M$5,'SP Welded'!C96,\"\")))","v":31.5}]
[{"$f":"IF($I$3=$M$3,'SP Plus Bolted'!A97,IF($I$3=$M$4,'SP Bolted'!A97,IF($I$3=$M$5,'SP Welded'!A97,\"\")))","v":"W27X114"},{"$f":"IF($I$3=$M$3,'SP Plus Bolted'!B97,IF($I$3=$M$4,'SP Bolted'!B97,IF($I$3=$M$5,'SP Welded'!B97,\"\")))","v":24},{"$f":"IF($I$3=$M$3,'SP Plus Bolted'!C97,IF($I$3=$M$4,'SP Bolted'!C97,IF($I$3=$M$5,'SP Welded'!C97,\"\")))","v":31}]
[{"$f":"IF($I$3=$M$3,'SP Plus Bolted'!A98,IF($I$3=$M$4,'SP Bolted'!A98,IF($I$3=$M$5,'SP Welded'!A98,\"\")))","v":"W27X102"},{"$f":"IF($I$3=$M$3,'SP Plus Bolted'!B98,IF($I$3=$M$4,'SP Bolted'!B98,IF($I$3=$M$5,'SP Welded'!B98,\"\")))","v":24},{"$f":"IF($I$3=$M$3,'SP Plus Bolted'!C98,IF($I$3=$M$4,'SP Bolted'!C98,IF($I$3=$M$5,'SP Welded'!C98,\"\")))","v":31}]
[{"$f":"IF($I$3=$M$3,'SP Plus Bolted'!A99,IF($I$3=$M$4,'SP Bolted'!A99,IF($I$3=$M$5,'SP Welded'!A99,\"\")))","v":"W27X94"},{"$f":"IF($I$3=$M$3,'SP Plus Bolted'!B99,IF($I$3=$M$4,'SP Bolted'!B99,IF($I$3=$M$5,'SP Welded'!B99,\"\")))","v":23},{"$f":"IF($I$3=$M$3,'SP Plus Bolted'!C99,IF($I$3=$M$4,'SP Bolted'!C99,IF($I$3=$M$5,'SP Welded'!C99,\"\")))","v":30.5}]
[{"$f":"IF($I$3=$M$3,'SP Plus Bolted'!A100,IF($I$3=$M$4,'SP Bolted'!A100,IF($I$3=$M$5,'SP Welded'!A100,\"\")))","v":"W27X84"},{"$f":"IF($I$3=$M$3,'SP Plus Bolted'!B100,IF($I$3=$M$4,'SP Bolted'!B100,IF($I$3=$M$5,'SP Welded'!B100,\"\")))","v":23},{"$f":"IF($I$3=$M$3,'SP Plus Bolted'!C100,IF($I$3=$M$4,'SP Bolted'!C100,IF($I$3=$M$5,'SP Welded'!C100,\"\")))","v":30.5}]
[{"$f":"IF($I$3=$M$3,'SP Plus Bolted'!A101,IF($I$3=$M$4,'SP Bolted'!A101,IF($I$3=$M$5,'SP Welded'!A101,\"\")))","v":"W24X370"},{"$f":"IF($I$3=$M$3,'SP Plus Bolted'!B101,IF($I$3=$M$4,'SP Bolted'!B101,IF($I$3=$M$5,'SP Welded'!B101,\"\")))","v":24},{"$f":"IF($I$3=$M$3,'SP Plus Bolted'!C101,IF($I$3=$M$4,'SP Bolted'!C101,IF($I$3=$M$5,'SP Welded'!C101,\"\")))","v":31.5}]
[{"$f":"IF($I$3=$M$3,'SP Plus Bolted'!A102,IF($I$3=$M$4,'SP Bolted'!A102,IF($I$3=$M$5,'SP Welded'!A102,\"\")))","v":"W24X335"},{"$f":"IF($I$3=$M$3,'SP Plus Bolted'!B102,IF($I$3=$M$4,'SP Bolted'!B102,IF($I$3=$M$5,'SP Welded'!B102,\"\")))","v":24},{"$f":"IF($I$3=$M$3,'SP Plus Bolted'!C102,IF($I$3=$M$4,'SP Bolted'!C102,IF($I$3=$M$5,'SP Welded'!C102,\"\")))","v":31}]
[{"$f":"IF($I$3=$M$3,'SP Plus Bolted'!A103,IF($I$3=$M$4,'SP Bolted'!A103,IF($I$3=$M$5,'SP Welded'!A103,\"\")))","v":"W24X306"},{"$f":"IF($I$3=$M$3,'SP Plus Bolted'!B103,IF($I$3=$M$4,'SP Bolted'!B103,IF($I$3=$M$5,'SP Welded'!B103,\"\")))","v":24},{"$f":"IF($I$3=$M$3,'SP Plus Bolted'!C103,IF($I$3=$M$4,'SP Bolted'!C103,IF($I$3=$M$5,'SP Welded'!C103,\"\")))","v":31}]
[{"$f":"IF($I$3=$M$3,'SP Plus Bolted'!A104,IF($I$3=$M$4,'SP Bolted'!A104,IF($I$3=$M$5,'SP Welded'!A104,\"\")))","v":"W24X279"},{"$f":"IF($I$3=$M$3,'SP Plus Bolted'!B104,IF($I$3=$M$4,'SP Bolted'!B104,IF($I$3=$M$5,'SP Welded'!B104,\"\")))","v":23},{"$f":"IF($I$3=$M$3,'SP Plus Bolted'!C104,IF($I$3=$M$4,'SP Bolted'!C104,IF($I$3=$M$5,'SP Welded'!C104,\"\")))","v":30.5}]
[{"$f":"IF($I$3=$M$3,'SP Plus Bolted'!A105,IF($I$3=$M$4,'SP Bolted'!A105,IF($I$3=$M$5,'SP Welded'!A105,\"\")))","v":"W24X250"},{"$f":"IF($I$3=$M$3,'SP Plus Bolted'!B105,IF($I$3=$M$4,'SP Bolted'!B105,IF($I$3=$M$5,'SP Welded'!B105,\"\")))","v":23},{"$f":"IF($I$3=$M$3,'SP Plus Bolted'!C105,IF($I$3=$M$4,'SP Bolted'!C105,IF($I$3=$M$5,'SP Welded'!C105,\"\")))","v":30}]
[{"$f":"IF($I$3=$M$3,'SP Plus Bolted'!A106,IF($I$3=$M$4,'SP Bolted'!A106,IF($I$3=$M$5,'SP Welded'!A106,\"\")))","v":"W24X229"},{"$f":"IF($I$3=$M$3,'SP Plus Bolted'!B106,IF($I$3=$M$4,'SP Bolted'!B106,IF($I$3=$M$5,'SP Welded'!B106,\"\")))","v":23},{"$f":"IF($I$3=$M$3,'SP Plus Bolted'!C106,IF($I$3=$M$4,'SP Bolted'!C106,IF($I$3=$M$5,'SP Welded'!C106,\"\")))","v":29.5}]
[{"$f":"IF($I$3=$M$3,'SP Plus Bolted'!A107,IF($I$3=$M$4,'SP Bolted'!A107,IF($I$3=$M$5,'SP Welded'!A107,\"\")))","v":"W24X207"},{"$f":"IF($I$3=$M$3,'SP Plus Bolted'!B107,IF($I$3=$M$4,'SP Bolted'!B107,IF($I$3=$M$5,'SP Welded'!B107,\"\")))","v":22},{"$f":"IF($I$3=$M$3,'SP Plus Bolted'!C107,IF($I$3=$M$4,'SP Bolted'!C107,IF($I$3=$M$5,'SP Welded'!C107,\"\")))","v":29.5}]
[{"$f":"IF($I$3=$M$3,'SP Plus Bolted'!A108,IF($I$3=$M$4,'SP Bolted'!A108,IF($I$3=$M$5,'SP Welded'!A108,\"\")))","v":"W24X192"},{"$f":"IF($I$3=$M$3,'SP Plus Bolted'!B108,IF($I$3=$M$4,'SP Bolted'!B108,IF($I$3=$M$5,'SP Welded'!B108,\"\")))","v":22},{"$f":"IF($I$3=$M$3,'SP Plus Bolted'!C108,IF($I$3=$M$4,'SP Bolted'!C108,IF($I$3=$M$5,'SP Welded'!C108,\"\")))","v":29}]
[{"$f":"IF($I$3=$M$3,'SP Plus Bolted'!A109,IF($I$3=$M$4,'SP Bolted'!A109,IF($I$3=$M$5,'SP Welded'!A109,\"\")))","v":"W24X176"},{"$f":"IF($I$3=$M$3,'SP Plus Bolted'!B109,IF($I$3=$M$4,'SP Bolted'!B109,IF($I$3=$M$5,'SP Welded'!B109,\"\")))","v":22},{"$f":"IF($I$3=$M$3,'SP Plus Bolted'!C109,IF($I$3=$M$4,'SP Bolted'!C109,IF($I$3=$M$5,'SP Welded'!C109,\"\")))","v":29}]
[{"$f":"IF($I$3=$M$3,'SP Plus Bolted'!A110,IF($I$3=$M$4,'SP Bolted'!A110,IF($I$3=$M$5,'SP Welded'!A110,\"\")))","v":"W24X162"},{"$f":"IF($I$3=$M$3,'SP Plus Bolted'!B110,IF($I$3=$M$4,'SP Bolted'!B110,IF($I$3=$M$5,'SP Welded'!B110,\"\")))","v":22},{"$f":"IF($I$3=$M$3,'SP Plus Bolted'!C110,IF($I$3=$M$4,'SP Bolted'!C110,IF($I$3=$M$5,'SP Welded'!C110,\"\")))","v":28.5}]
[{"$f":"IF($I$3=$M$3,'SP Plus Bolted'!A111,IF($I$3=$M$4,'SP Bolted'!A111,IF($I$3=$M$5,'SP Welded'!A111,\"\")))","v":"W24X146"},{"$f":"IF($I$3=$M$3,'SP Plus Bolted'!B111,IF($I$3=$M$4,'SP Bolted'!B111,IF($I$3=$M$5,'SP Welded'!B111,\"\")))","v":22},{"$f":"IF($I$3=$M$3,'SP Plus Bolted'!C111,IF($I$3=$M$4,'SP Bolted'!C111,IF($I$3=$M$5,'SP Welded'!C111,\"\")))","v":28.5}]
[{"$f":"IF($I$3=$M$3,'SP Plus Bolted'!A112,IF($I$3=$M$4,'SP Bolted'!A112,IF($I$3=$M$5,'SP Welded'!A112,\"\")))","v":"W24X131"},{"$f":"IF($I$3=$M$3,'SP Plus Bolted'!B112,IF($I$3=$M$4,'SP Bolted'!B112,IF($I$3=$M$5,'SP Welded'!B112,\"\")))","v":21},{"$f":"IF($I$3=$M$3,'SP Plus Bolted'!C112,IF($I$3=$M$4,'SP Bolted'!C112,IF($I$3=$M$5,'SP Welded'!C112,\"\")))","v":28}]
[{"$f":"IF($I$3=$M$3,'SP Plus Bolted'!A113,IF($I$3=$M$4,'SP Bolted'!A113,IF($I$3=$M$5,'SP Welded'!A113,\"\")))","v":"W24X117"},{"$f":"IF($I$3=$M$3,'SP Plus Bolted'!B113,IF($I$3=$M$4,'SP Bolted'!B113,IF($I$3=$M$5,'SP Welded'!B113,\"\")))","v":21},{"$f":"IF($I$3=$M$3,'SP Plus Bolted'!C113,IF($I$3=$M$4,'SP Bolted'!C113,IF($I$3=$M$5,'SP Welded'!C113,\"\")))","v":28}]
[{"$f":"IF($I$3=$M$3,'SP Plus Bolted'!A114,IF($I$3=$M$4,'SP Bolted'!A114,IF($I$3=$M$5,'SP Welded'!A114,\"\")))","v":"W24X104"},{"$f":"IF($I$3=$M$3,'SP Plus Bolted'!B114,IF($I$3=$M$4,'SP Bolted'!B114,IF($I$3=$M$5,'SP Welded'!B114,\"\")))","v":21},{"$f":"IF($I$3=$M$3,'SP Plus Bolted'!C114,IF($I$3=$M$4,'SP Bolted'!C114,IF($I$3=$M$5,'SP Welded'!C114,\"\")))","v":27.5}]
[{"$f":"IF($I$3=$M$3,'SP Plus Bolted'!A115,IF($I$3=$M$4,'SP Bolted'!A115,IF($I$3=$M$5,'SP Welded'!A115,\"\")))","v":"W24X103"},{"$f":"IF($I$3=$M$3,'SP Plus Bolted'!B115,IF($I$3=$M$4,'SP Bolted'!B115,IF($I$3=$M$5,'SP Welded'!B115,\"\")))","v":21},{"$f":"IF($I$3=$M$3,'SP Plus Bolted'!C115,IF($I$3=$M$4,'SP Bolted'!C115,IF($I$3=$M$5,'SP Welded'!C115,\"\")))","v":28}]
[{"$f":"IF($I$3=$M$3,'SP Plus Bolted'!A116,IF($I$3=$M$4,'SP Bolted'!A116,IF($I$3=$M$5,'SP Welded'!A116,\"\")))","v":"W24X94"},{"$f":"IF($I$3=$M$3,'SP Plus Bolted'!B116,IF($I$3=$M$4,'SP Bolted'!B116,IF($I$3=$M$5,'SP Welded'!B116,\"\")))","v":21},{"$f":"IF($I$3=$M$3,'SP Plus Bolted'!C116,IF($I$3=$M$4,'SP Bolted'!C116,IF($I$3=$M$5,'SP Welded'!C116,\"\")))","v":28}]
[{"$f":"IF($I$3=$M$3,'SP Plus Bolted'!A117,IF($I$3=$M$4,'SP Bolted'!A117,IF($I$3=$M$5,'SP Welded'!A117,\"\")))","v":"W24X84"},{"$f":"IF($I$3=$M$3,'SP Plus Bolted'!B117,IF($I$3=$M$4,'SP Bolted'!B117,IF($I$3=$M$5,'SP Welded'!B117,\"\")))","v":21},{"$f":"IF($I$3=$M$3,'SP Plus Bolted'!C117,IF($I$3=$M$4,'SP Bolted'!C117,IF($I$3=$M$5,'SP Welded'!C117,\"\")))","v":28}]
[{"$f":"IF($I$3=$M$3,'SP Plus Bolted'!A118,IF($I$3=$M$4,'SP Bolted'!A118,IF($I$3=$M$5,'SP Welded'!A118,\"\")))","v":"W24X76"},{"$f":"IF($I$3=$M$3,'SP Plus Bolted'!B118,IF($I$3=$M$4,'SP Bolted'!B118,IF($I$3=$M$5,'SP Welded'!B118,\"\")))","v":21},{"$f":"IF($I$3=$M$3,'SP Plus Bolted'!C118,IF($I$3=$M$4,'SP Bolted'!C118,IF($I$3=$M$5,'SP Welded'!C118,\"\")))","v":27.5}]
[{"$f":"IF($I$3=$M$3,'SP Plus Bolted'!A119,IF($I$3=$M$4,'SP Bolted'!A119,IF($I$3=$M$5,'SP Welded'!A119,\"\")))","v":"W24X68"},{"$f":"IF($I$3=$M$3,'SP Plus Bolted'!B119,IF($I$3=$M$4,'SP Bolted'!B119,IF($I$3=$M$5,'SP Welded'!B119,\"\")))","v":21},{"$f":"IF($I$3=$M$3,'SP Plus Bolted'!C119,IF($I$3=$M$4,'SP Bolted'!C119,IF($I$3=$M$5,'SP Welded'!C119,\"\")))","v":27.5}]
[{"$f":"IF($I$3=$M$3,'SP Plus Bolted'!A120,IF($I$3=$M$4,'SP Bolted'!A120,IF($I$3=$M$5,'SP Welded'!A120,\"\")))","v":"W24X62"},{"$f":"IF($I$3=$M$3,'SP Plus Bolted'!B120,IF($I$3=$M$4,'SP Bolted'!B120,IF($I$3=$M$5,'SP Welded'!B120,\"\")))","v":21},{"$f":"IF($I$3=$M$3,'SP Plus Bolted'!C120,IF($I$3=$M$4,'SP Bolted'!C120,IF($I$3=$M$5,'SP Welded'!C120,\"\")))","v":27.5}]
[{"$f":"IF($I$3=$M$3,'SP Plus Bolted'!A121,IF($I$3=$M$4,'SP Bolted'!A121,IF($I$3=$M$5,'SP Welded'!A121,\"\")))","v":"W24X55"},{"$f":"IF($I$3=$M$3,'SP Plus Bolted'!B121,IF($I$3=$M$4,'SP Bolted'!B121,IF($I$3=$M$5,'SP Welded'!B121,\"\")))","v":21},{"$f":"IF($I$3=$M$3,'SP Plus Bolted'!C121,IF($I$3=$M$4,'SP Bolted'!C121,IF($I$3=$M$5,'SP Welded'!C121,\"\")))","v":27.5}]
[{"$f":"IF($I$3=$M$3,'SP Plus Bolted'!A122,IF($I$3=$M$4,'SP Bolted'!A122,IF($I$3=$M$5,'SP Welded'!A122,\"\")))","v":"W21X275"},{"$f":"IF($I$3=$M$3,'SP Plus Bolted'!B122,IF($I$3=$M$4,'SP Bolted'!B122,IF($I$3=$M$5,'SP Welded'!B122,\"\")))","v":21},{"$f":"IF($I$3=$M$3,'SP Plus Bolted'!C122,IF($I$3=$M$4,'SP Bolted'!C122,IF($I$3=$M$5,'SP Welded'!C122,\"\")))","v":28}]
[{"$f":"IF($I$3=$M$3,'SP Plus Bolted'!A123,IF($I$3=$M$4,'SP Bolted'!A123,IF($I$3=$M$5,'SP Welded'!A123,\"\")))","v":"W21X248"},{"$f":"IF($I$3=$M$3,'SP Plus Bolted'!B123,IF($I$3=$M$4,'SP Bolted'!B123,IF($I$3=$M$5,'SP Welded'!B123,\"\")))","v":21},{"$f":"IF($I$3=$M$3,'SP Plus Bolted'!C123,IF($I$3=$M$4,'SP Bolted'!C123,IF($I$3=$M$5,'SP Welded'!C123,\"\")))","v":27.5}]
[{"$f":"IF($I$3=$M$3,'SP Plus Bolted'!A124,IF($I$3=$M$4,'SP Bolted'!A124,IF($I$3=$M$5,'SP Welded'!A124,\"\")))","v":"W21X223"},{"$f":"IF($I$3=$M$3,'SP Plus Bolted'!B124,IF($I$3=$M$4,'SP Bolted'!B124,IF($I$3=$M$5,'SP Welded'!B124,\"\")))","v":20},{"$f":"IF($I$3=$M$3,'SP Plus Bolted'!C124,IF($I$3=$M$4,'SP Bolted'!C124,IF($I$3=$M$5,'SP Welded'!C124,\"\")))","v":27}]
[{"$f":"IF($I$3=$M$3,'SP Plus Bolted'!A125,IF($I$3=$M$4,'SP Bolted'!A125,IF($I$3=$M$5,'SP Welded'!A125,\"\")))","v":"W21X201"},{"$f":"IF($I$3=$M$3,'SP Plus Bolted'!B125,IF($I$3=$M$4,'SP Bolted'!B125,IF($I$3=$M$5,'SP Welded'!B125,\"\")))","v":20},{"$f":"IF($I$3=$M$3,'SP Plus Bolted'!C125,IF($I$3=$M$4,'SP Bolted'!C125,IF($I$3=$M$5,'SP Welded'!C125,\"\")))","v":26.5}]
[{"$f":"IF($I$3=$M$3,'SP Plus Bolted'!A126,IF($I$3=$M$4,'SP Bolted'!A126,IF($I$3=$M$5,'SP Welded'!A126,\"\")))","v":"W21X182"},{"$f":"IF($I$3=$M$3,'SP Plus Bolted'!B126,IF($I$3=$M$4,'SP Bolted'!B126,IF($I$3=$M$5,'SP Welded'!B126,\"\")))","v":20},{"$f":"IF($I$3=$M$3,'SP Plus Bolted'!C126,IF($I$3=$M$4,'SP Bolted'!C126,IF($I$3=$M$5,'SP Welded'!C126,\"\")))","v":26.5}]
[{"$f":"IF($I$3=$M$3,'SP Plus Bolted'!A127,IF($I$3=$M$4,'SP Bolted'!A127,IF($I$3=$M$5,'SP Welded'!A127,\"\")))","v":"W21X166"},{"$f":"IF($I$3=$M$3,'SP Plus Bolted'!B127,IF($I$3=$M$4,'SP Bolted'!B127,IF($I$3=$M$5,'SP Welded'!B127,\"\")))","v":20},{"$f":"IF($I$3=$M$3,'SP Plus Bolted'!C127,IF($I$3=$M$4,'SP Bolted'!C127,IF($I$3=$M$5,'SP Welded'!C127,\"\")))","v":26}]
[{"$f":"IF($I$3=$M$3,'SP Plus Bolted'!A128,IF($I$3=$M$4,'SP Bolted'!A128,IF($I$3=$M$5,'SP Welded'!A128,\"\")))","v":"W21X147"},{"$f":"IF($I$3=$M$3,'SP Plus Bolted'!B128,IF($I$3=$M$4,'SP Bolted'!B128,IF($I$3=$M$5,'SP Welded'!B128,\"\")))","v":19},{"$f":"IF($I$3=$M$3,'SP Plus Bolted'!C128,IF($I$3=$M$4,'SP Bolted'!C128,IF($I$3=$M$5,'SP Welded'!C128,\"\")))","v":25.5}]
[{"$f":"IF($I$3=$M$3,'SP Plus Bolted'!A129,IF($I$3=$M$4,'SP Bolted'!A129,IF($I$3=$M$5,'SP Welded'!A129,\"\")))","v":"W21X132"},{"$f":"IF($I$3=$M$3,'SP Plus Bolted'!B129,IF($I$3=$M$4,'SP Bolted'!B129,IF($I$3=$M$5,'SP Welded'!B129,\"\")))","v":19},{"$f":"IF($I$3=$M$3,'SP Plus Bolted'!C129,IF($I$3=$M$4,'SP Bolted'!C129,IF($I$3=$M$5,'SP Welded'!C129,\"\")))","v":25.5}]
[{"$f":"IF($I$3=$M$3,'SP Plus Bolted'!A130,IF($I$3=$M$4,'SP Bolted'!A130,IF($I$3=$M$5,'SP Welded'!A130,\"\")))","v":"W21X122"},{"$f":"IF($I$3=$M$3,'SP Plus Bolted'!B130,IF($I$3=$M$4,'SP Bolted'!B130,IF($I$3=$M$5,'SP Welded'!B130,\"\")))","v":19},{"$f":"IF($I$3=$M$3,'SP Plus Bolted'!C130,IF($I$3=$M$4,'SP Bolted'!C130,IF($I$3=$M$5,'SP Welded'!C130,\"\")))","v":25.5}]
[{"$f":"IF($I$3=$M$3,'SP Plus Bolted'!A131,IF($I$3=$M$4,'SP Bolted'!A131,IF($I$3=$M$5,'SP Welded'!A131,\"\")))","v":"W21X111"},{"$f":"IF($I$3=$M$3,'SP Plus Bolted'!B131,IF($I$3=$M$4,'SP Bolted'!B131,IF($I$3=$M$5,'SP Welded'!B131,\"\")))","v":19},{"$f":"IF($I$3=$M$3,'SP Plus Bolted'!C131,IF($I$3=$M$4,'SP Bolted'!C131,IF($I$3=$M$5,'SP Welded'!C131,\"\")))","v":25}]
[{"$f":"IF($I$3=$M$3,'SP Plus Bolted'!A132,IF($I$3=$M$4,'SP Bolted'!A132,IF($I$3=$M$5,'SP Welded'!A132,\"\")))","v":"W21X101"},{"$f":"IF($I$3=$M$3,'SP Plus Bolted'!B132,IF($I$3=$M$4,'SP Bolted'!B132,IF($I$3=$M$5,'SP Welded'!B132,\"\")))","v":19},{"$f":"IF($I$3=$M$3,'SP Plus Bolted'!C132,IF($I$3=$M$4,'SP Bolted'!C132,IF($I$3=$M$5,'SP Welded'!C132,\"\")))","v":25}]
[{"$f":"IF($I$3=$M$3,'SP Plus Bolted'!A133,IF($I$3=$M$4,'SP Bolted'!A133,IF($I$3=$M$5,'SP Welded'!A133,\"\")))","v":"W21X93"},{"$f":"IF($I$3=$M$3,'SP Plus Bolted'!B133,IF($I$3=$M$4,'SP Bolted'!B133,IF($I$3=$M$5,'SP Welded'!B133,\"\")))","v":19},{"$f":"IF($I$3=$M$3,'SP Plus Bolted'!C133,IF($I$3=$M$4,'SP Bolted'!C133,IF($I$3=$M$5,'SP Welded'!C133,\"\")))","v":25.5}]
[{"$f":"IF($I$3=$M$3,'SP Plus Bolted'!A134,IF($I$3=$M$4,'SP Bolted'!A134,IF($I$3=$M$5,'SP Welded'!A134,\"\")))","v":"W21X83"},{"$f":"IF($I$3=$M$3,'SP Plus Bolted'!B134,IF($I$3=$M$4,'SP Bolted'!B134,IF($I$3=$M$5,'SP Welded'!B134,\"\")))","v":19},{"$f":"IF($I$3=$M$3,'SP Plus Bolted'!C134,IF($I$3=$M$4,'SP Bolted'!C134,IF($I$3=$M$5,'SP Welded'!C134,\"\")))","v":25}]
[{"$f":"IF($I$3=$M$3,'SP Plus Bolted'!A135,IF($I$3=$M$4,'SP Bolted'!A135,IF($I$3=$M$5,'SP Welded'!A135,\"\")))","v":"W21X73"},{"$f":"IF($I$3=$M$3,'SP Plus Bolted'!B135,IF($I$3=$M$4,'SP Bolted'!B135,IF($I$3=$M$5,'SP Welded'!B135,\"\")))","v":19},{"$f":"IF($I$3=$M$3,'SP Plus Bolted'!C135,IF($I$3=$M$4,'SP Bolted'!C135,IF($I$3=$M$5,'SP Welded'!C135,\"\")))","v":25}]
[{"$f":"IF($I$3=$M$3,'SP Plus Bolted'!A136,IF($I$3=$M$4,'SP Bolted'!A136,IF($I$3=$M$5,'SP Welded'!A136,\"\")))","v":"W21X68"},{"$f":"IF($I$3=$M$3,'SP Plus Bolted'!B136,IF($I$3=$M$4,'SP Bolted'!B136,IF($I$3=$M$5,'SP Welded'!B136,\"\")))","v":18},{"$f":"IF($I$3=$M$3,'SP Plus Bolted'!C136,IF($I$3=$M$4,'SP Bolted'!C136,IF($I$3=$M$5,'SP Welded'!C136,\"\")))","v":25}]
[{"$f":"IF($I$3=$M$3,'SP Plus Bolted'!A137,IF($I$3=$M$4,'SP Bolted'!A137,IF($I$3=$M$5,'SP Welded'!A137,\"\")))","v":"W21X62"},{"$f":"IF($I$3=$M$3,'SP Plus Bolted'!B137,IF($I$3=$M$4,'SP Bolted'!B137,IF($I$3=$M$5,'SP Welded'!B137,\"\")))","v":18},{"$f":"IF($I$3=$M$3,'SP Plus Bolted'!C137,IF($I$3=$M$4,'SP Bolted'!C137,IF($I$3=$M$5,'SP Welded'!C137,\"\")))","v":24.5}]
[{"$f":"IF($I$3=$M$3,'SP Plus Bolted'!A138,IF($I$3=$M$4,'SP Bolted'!A138,IF($I$3=$M$5,'SP Welded'!A138,\"\")))","v":"W21X55"},{"$f":"IF($I$3=$M$3,'SP Plus Bolted'!B138,IF($I$3=$M$4,'SP Bolted'!B138,IF($I$3=$M$5,'SP Welded'!B138,\"\")))","v":18},{"$f":"IF($I$3=$M$3,'SP Plus Bolted'!C138,IF($I$3=$M$4,'SP Bolted'!C138,IF($I$3=$M$5,'SP Welded'!C138,\"\")))","v":24.5}]
[{"$f":"IF($I$3=$M$3,'SP Plus Bolted'!A139,IF($I$3=$M$4,'SP Bolted'!A139,IF($I$3=$M$5,'SP Welded'!A139,\"\")))","v":"W21X48"},{"$f":"IF($I$3=$M$3,'SP Plus Bolted'!B139,IF($I$3=$M$4,'SP Bolted'!B139,IF($I$3=$M$5,'SP Welded'!B139,\"\")))","v":18},{"$f":"IF($I$3=$M$3,'SP Plus Bolted'!C139,IF($I$3=$M$4,'SP Bolted'!C139,IF($I$3=$M$5,'SP Welded'!C139,\"\")))","v":24.5}]
[{"$f":"IF($I$3=$M$3,'SP Plus Bolted'!A140,IF($I$3=$M$4,'SP Bolted'!A140,IF($I$3=$M$5,'SP Welded'!A140,\"\")))","v":"W21X57"},{"$f":"IF($I$3=$M$3,'SP Plus Bolted'!B140,IF($I$3=$M$4,'SP Bolted'!B140,IF($I$3=$M$5,'SP Welded'!B140,\"\")))","v":18},{"$f":"IF($I$3=$M$3,'SP Plus Bolted'!C140,IF($I$3=$M$4,'SP Bolted'!C140,IF($I$3=$M$5,'SP Welded'!C140,\"\")))","v":24.5}]
[{"$f":"IF($I$3=$M$3,'SP Plus Bolted'!A141,IF($I$3=$M$4,'SP Bolted'!A141,IF($I$3=$M$5,'SP Welded'!A141,\"\")))","v":"W21X50"},{"$f":"IF($I$3=$M$3,'SP Plus Bolted'!B141,IF($I$3=$M$4,'SP Bolted'!B141,IF($I$3=$M$5,'SP Welded'!B141,\"\")))","v":18},{"$f":"IF($I$3=$M$3,'SP Plus Bolted'!C141,IF($I$3=$M$4,'SP Bolted'!C141,IF($I$3=$M$5,'SP Welded'!C141,\"\")))","v":24.5}]
[{"$f":"IF($I$3=$M$3,'SP Plus Bolted'!A142,IF($I$3=$M$4,'SP Bolted'!A142,IF($I$3=$M$5,'SP Welded'!A142,\"\")))","v":"W21X44"},{"$f":"IF($I$3=$M$3,'SP Plus Bolted'!B142,IF($I$3=$M$4,'SP Bolted'!B142,IF($I$3=$M$5,'SP Welded'!B142,\"\")))","v":18},{"$f":"IF($I$3=$M$3,'SP Plus Bolted'!C142,IF($I$3=$M$4,'SP Bolted'!C142,IF($I$3=$M$5,'SP Welded'!C142,\"\")))","v":24.5}]
[{"$f":"IF($I$3=$M$3,'SP Plus Bolted'!A143,IF($I$3=$M$4,'SP Bolted'!A143,IF($I$3=$M$5,'SP Welded'!A143,\"\")))","v":"W18X311"},{"$f":"IF($I$3=$M$3,'SP Plus Bolted'!B143,IF($I$3=$M$4,'SP Bolted'!B143,IF($I$3=$M$5,'SP Welded'!B143,\"\")))","v":20},{"$f":"IF($I$3=$M$3,'SP Plus Bolted'!C143,IF($I$3=$M$4,'SP Bolted'!C143,IF($I$3=$M$5,'SP Welded'!C143,\"\")))","v":26}]
[{"$f":"IF($I$3=$M$3,'SP Plus Bolted'!A144,IF($I$3=$M$4,'SP Bolted'!A144,IF($I$3=$M$5,'SP Welded'!A144,\"\")))","v":"W18X283"},{"$f":"IF($I$3=$M$3,'SP Plus Bolted'!B144,IF($I$3=$M$4,'SP Bolted'!B144,IF($I$3=$M$5,'SP Welded'!B144,\"\")))","v":19},{"$f":"IF($I$3=$M$3,'SP Plus Bolted'!C144,IF($I$3=$M$4,'SP Bolted'!C144,IF($I$3=$M$5,'SP Welded'!C144,\"\")))","v":25.5}]
[{"$f":"IF($I$3=$M$3,'SP Plus Bolted'!A145,IF($I$3=$M$4,'SP Bolted'!A145,IF($I$3=$M$5,'SP Welded'!A145,\"\")))","v":"W18X258"},{"$f":"IF($I$3=$M$3,'SP Plus Bolted'!B145,IF($I$3=$M$4,'SP Bolted'!B145,IF($I$3=$M$5,'SP Welded'!B145,\"\")))","v":19},{"$f":"IF($I$3=$M$3,'SP Plus Bolted'!C145,IF($I$3=$M$4,'SP Bolted'!C145,IF($I$3=$M$5,'SP Welded'!C145,\"\")))","v":25}]
[{"$f":"IF($I$3=$M$3,'SP Plus Bolted'!A146,IF($I$3=$M$4,'SP Bolted'!A146,IF($I$3=$M$5,'SP Welded'!A146,\"\")))","v":"W18X234"},{"$f":"IF($I$3=$M$3,'SP Plus Bolted'!B146,IF($I$3=$M$4,'SP Bolted'!B146,IF($I$3=$M$5,'SP Welded'!B146,\"\")))","v":18},{"$f":"IF($I$3=$M$3,'SP Plus Bolted'!C146,IF($I$3=$M$4,'SP Bolted'!C146,IF($I$3=$M$5,'SP Welded'!C146,\"\")))","v":24.5}]
[{"$f":"IF($I$3=$M$3,'SP Plus Bolted'!A147,IF($I$3=$M$4,'SP Bolted'!A147,IF($I$3=$M$5,'SP Welded'!A147,\"\")))","v":"W18X211"},{"$f":"IF($I$3=$M$3,'SP Plus Bolted'!B147,IF($I$3=$M$4,'SP Bolted'!B147,IF($I$3=$M$5,'SP Welded'!B147,\"\")))","v":18},{"$f":"IF($I$3=$M$3,'SP Plus Bolted'!C147,IF($I$3=$M$4,'SP Bolted'!C147,IF($I$3=$M$5,'SP Welded'!C147,\"\")))","v":24.5}]
[{"$f":"IF($I$3=$M$3,'SP Plus Bolted'!A148,IF($I$3=$M$4,'SP Bolted'!A148,IF($I$3=$M$5,'SP Welded'!A148,\"\")))","v":"W18X192"},{"$f":"IF($I$3=$M$3,'SP Plus Bolted'!B148,IF($I$3=$M$4,'SP Bolted'!B148,IF($I$3=$M$5,'SP Welded'!B148,\"\")))","v":18},{"$f":"IF($I$3=$M$3,'SP Plus Bolted'!C148,IF($I$3=$M$4,'SP Bolted'!C148,IF($I$3=$M$5,'SP Welded'!C148,\"\")))","v":24}]
[{"$f":"IF($I$3=$M$3,'SP Plus Bolted'!A149,IF($I$3=$M$4,'SP Bolted'!A149,IF($I$3=$M$5,'SP Welded'!A149,\"\")))","v":"W18X175"},{"$f":"IF($I$3=$M$3,'SP Plus Bolted'!B149,IF($I$3=$M$4,'SP Bolted'!B149,IF($I$3=$M$5,'SP Welded'!B149,\"\")))","v":17},{"$f":"IF($I$3=$M$3,'SP Plus Bolted'!C149,IF($I$3=$M$4,'SP Bolted'!C149,IF($I$3=$M$5,'SP Welded'!C149,\"\")))","v":23.5}]
[{"$f":"IF($I$3=$M$3,'SP Plus Bolted'!A150,IF($I$3=$M$4,'SP Bolted'!A150,IF($I$3=$M$5,'SP Welded'!A150,\"\")))","v":"W18X158"},{"$f":"IF($I$3=$M$3,'SP Plus Bolted'!B150,IF($I$3=$M$4,'SP Bolted'!B150,IF($I$3=$M$5,'SP Welded'!B150,\"\")))","v":17},{"$f":"IF($I$3=$M$3,'SP Plus Bolted'!C150,IF($I$3=$M$4,'SP Bolted'!C150,IF($I$3=$M$5,'SP Welded'!C150,\"\")))","v":23.5}]
[{"$f":"IF($I$3=$M$3,'SP Plus Bolted'!A151,IF($I$3=$M$4,'SP Bolted'!A151,IF($I$3=$M$5,'SP Welded'!A151,\"\")))","v":"W18X143"},{"$f":"IF($I$3=$M$3,'SP Plus Bolted'!B151,IF($I$3=$M$4,'SP Bolted'!B151,IF($I$3=$M$5,'SP Welded'!B151,\"\")))","v":17},{"$f":"IF($I$3=$M$3,'SP Plus Bolted'!C151,IF($I$3=$M$4,'SP Bolted'!C151,IF($I$3=$M$5,'SP Welded'!C151,\"\")))","v":23}]
[{"$f":"IF($I$3=$M$3,'SP Plus Bolted'!A152,IF($I$3=$M$4,'SP Bolted'!A152,IF($I$3=$M$5,'SP Welded'!A152,\"\")))","v":"W18X130"},{"$f":"IF($I$3=$M$3,'SP Plus Bolted'!B152,IF($I$3=$M$4,'SP Bolted'!B152,IF($I$3=$M$5,'SP Welded'!B152,\"\")))","v":17},{"$f":"IF($I$3=$M$3,'SP Plus Bolted'!C152,IF($I$3=$M$4,'SP Bolted'!C152,IF($I$3=$M$5,'SP Welded'!C152,\"\")))","v":23}]
[{"$f":"IF($I$3=$M$3,'SP Plus Bolted'!A153,IF($I$3=$M$4,'SP Bolted'!A153,IF($I$3=$M$5,'SP Welded'!A153,\"\")))","v":"W18X119"},{"$f":"IF($I$3=$M$3,'SP Plus Bolted'!B153,IF($I$3=$M$4,'SP Bolted'!B153,IF($I$3=$M$5,'SP Welded'!B153,\"\")))","v":17},{"$f":"IF($I$3=$M$3,'SP Plus Bolted'!C153,IF($I$3=$M$4,'SP Bolted'!C153,IF($I$3=$M$5,'SP Welded'!C153,\"\")))","v":22.5}]
[{"$f":"IF($I$3=$M$3,'SP Plus Bolted'!A154,IF($I$3=$M$4,'SP Bolted'!A154,IF($I$3=$M$5,'SP Welded'!A154,\"\")))","v":"W18X106"},{"$f":"IF($I$3=$M$3,'SP Plus Bolted'!B154,IF($I$3=$M$4,'SP Bolted'!B154,IF($I$3=$M$5,'SP Welded'!B154,\"\")))","v":16},{"$f":"IF($I$3=$M$3,'SP Plus Bolted'!C154,IF($I$3=$M$4,'SP Bolted'!C154,IF($I$3=$M$5,'SP Welded'!C154,\"\")))","v":22.5}]
[{"$f":"IF($I$3=$M$3,'SP Plus Bolted'!A155,IF($I$3=$M$4,'SP Bolted'!A155,IF($I$3=$M$5,'SP Welded'!A155,\"\")))","v":"W18X97"},{"$f":"IF($I$3=$M$3,'SP Plus Bolted'!B155,IF($I$3=$M$4,'SP Bolted'!B155,IF($I$3=$M$5,'SP Welded'!B155,\"\")))","v":16},{"$f":"IF($I$3=$M$3,'SP Plus Bolted'!C155,IF($I$3=$M$4,'SP Bolted'!C155,IF($I$3=$M$5,'SP Welded'!C155,\"\")))","v":22.5}]
[{"$f":"IF($I$3=$M$3,'SP Plus Bolted'!A156,IF($I$3=$M$4,'SP Bolted'!A156,IF($I$3=$M$5,'SP Welded'!A156,\"\")))","v":"W18X86"},{"$f":"IF($I$3=$M$3,'SP Plus Bolted'!B156,IF($I$3=$M$4,'SP Bolted'!B156,IF($I$3=$M$5,'SP Welded'!B156,\"\")))","v":16},{"$f":"IF($I$3=$M$3,'SP Plus Bolted'!C156,IF($I$3=$M$4,'SP Bolted'!C156,IF($I$3=$M$5,'SP Welded'!C156,\"\")))","v":22}]
[{"$f":"IF($I$3=$M$3,'SP Plus Bolted'!A157,IF($I$3=$M$4,'SP Bolted'!A157,IF($I$3=$M$5,'SP Welded'!A157,\"\")))","v":"W18X76"},{"$f":"IF($I$3=$M$3,'SP Plus Bolted'!B157,IF($I$3=$M$4,'SP Bolted'!B157,IF($I$3=$M$5,'SP Welded'!B157,\"\")))","v":16},{"$f":"IF($I$3=$M$3,'SP Plus Bolted'!C157,IF($I$3=$M$4,'SP Bolted'!C157,IF($I$3=$M$5,'SP Welded'!C157,\"\")))","v":22}]
[{"$f":"IF($I$3=$M$3,'SP Plus Bolted'!A158,IF($I$3=$M$4,'SP Bolted'!A158,IF($I$3=$M$5,'SP Welded'!A158,\"\")))","v":"W18X71"},{"$f":"IF($I$3=$M$3,'SP Plus Bolted'!B158,IF($I$3=$M$4,'SP Bolted'!B158,IF($I$3=$M$5,'SP Welded'!B158,\"\")))","v":16},{"$f":"IF($I$3=$M$3,'SP Plus Bolted'!C158,IF($I$3=$M$4,'SP Bolted'!C158,IF($I$3=$M$5,'SP Welded'!C158,\"\")))","v":22}]
[{"$f":"IF($I$3=$M$3,'SP Plus Bolted'!A159,IF($I$3=$M$4,'SP Bolted'!A159,IF($I$3=$M$5,'SP Welded'!A159,\"\")))","v":"W18X65"},{"$f":"IF($I$3=$M$3,'SP Plus Bolted'!B159,IF($I$3=$M$4,'SP Bolted'!B159,IF($I$3=$M$5,'SP Welded'!B159,\"\")))","v":16},{"$f":"IF($I$3=$M$3,'SP Plus Bolted'!C159,IF($I$3=$M$4,'SP Bolted'!C159,IF($I$3=$M$5,'SP Welded'!C159,\"\")))","v":22}]
[{"$f":"IF($I$3=$M$3,'SP Plus Bolted'!A160,IF($I$3=$M$4,'SP Bolted'!A160,IF($I$3=$M$5,'SP Welded'!A160,\"\")))","v":"W18X60"},{"$f":"IF($I$3=$M$3,'SP Plus Bolted'!B160,IF($I$3=$M$4,'SP Bolted'!B160,IF($I$3=$M$5,'SP Welded'!B160,\"\")))","v":16},{"$f":"IF($I$3=$M$3,'SP Plus Bolted'!C160,IF($I$3=$M$4,'SP Bolted'!C160,IF($I$3=$M$5,'SP Welded'!C160,\"\")))","v":22}]
[{"$f":"IF($I$3=$M$3,'SP Plus Bolted'!A161,IF($I$3=$M$4,'SP Bolted'!A161,IF($I$3=$M$5,'SP Welded'!A161,\"\")))","v":"W18X55"},{"$f":"IF($I$3=$M$3,'SP Plus Bolted'!B161,IF($I$3=$M$4,'SP Bolted'!B161,IF($I$3=$M$5,'SP Welded'!B161,\"\")))","v":16},{"$f":"IF($I$3=$M$3,'SP Plus Bolted'!C161,IF($I$3=$M$4,'SP Bolted'!C161,IF($I$3=$M$5,'SP Welded'!C161,\"\")))","v":22}]
[{"$f":"IF($I$3=$M$3,'SP Plus Bolted'!A162,IF($I$3=$M$4,'SP Bolted'!A162,IF($I$3=$M$5,'SP Welded'!A162,\"\")))","v":"W18X50"},{"$f":"IF($I$3=$M$3,'SP Plus Bolted'!B162,IF($I$3=$M$4,'SP Bolted'!B162,IF($I$3=$M$5,'SP Welded'!B162,\"\")))","v":16},{"$f":"IF($I$3=$M$3,'SP Plus Bolted'!C162,IF($I$3=$M$4,'SP Bolted'!C162,IF($I$3=$M$5,'SP Welded'!C162,\"\")))","v":21.5}]
[{"$f":"IF($I$3=$M$3,'SP Plus Bolted'!A163,IF($I$3=$M$4,'SP Bolted'!A163,IF($I$3=$M$5,'SP Welded'!A163,\"\")))","v":"W18X46"},{"$f":"IF($I$3=$M$3,'SP Plus Bolted'!B163,IF($I$3=$M$4,'SP Bolted'!B163,IF($I$3=$M$5,'SP Welded'!B163,\"\")))","v":16},{"$f":"IF($I$3=$M$3,'SP Plus Bolted'!C163,IF($I$3=$M$4,'SP Bolted'!C163,IF($I$3=$M$5,'SP Welded'!C163,\"\")))","v":21.5}]
[{"$f":"IF($I$3=$M$3,'SP Plus Bolted'!A164,IF($I$3=$M$4,'SP Bolted'!A164,IF($I$3=$M$5,'SP Welded'!A164,\"\")))","v":"W18X40"},{"$f":"IF($I$3=$M$3,'SP Plus Bolted'!B164,IF($I$3=$M$4,'SP Bolted'!B164,IF($I$3=$M$5,'SP Welded'!B164,\"\")))","v":16},{"$f":"IF($I$3=$M$3,'SP Plus Bolted'!C164,IF($I$3=$M$4,'SP Bolted'!C164,IF($I$3=$M$5,'SP Welded'!C164,\"\")))","v":21.5}]
[{"$f":"IF($I$3=$M$3,'SP Plus Bolted'!A165,IF($I$3=$M$4,'SP Bolted'!A165,IF($I$3=$M$5,'SP Welded'!A165,\"\")))","v":"W18X35"},{"$f":"IF($I$3=$M$3,'SP Plus Bolted'!B165,IF($I$3=$M$4,'SP Bolted'!B165,IF($I$3=$M$5,'SP Welded'!B165,\"\")))","v":16},{"$f":"IF($I$3=$M$3,'SP Plus Bolted'!C165,IF($I$3=$M$4,'SP Bolted'!C165,IF($I$3=$M$5,'SP Welded'!C165,\"\")))","v":21.5}]
[{"$f":"IF($I$3=$M$3,'SP Plus Bolted'!A166,IF($I$3=$M$4,'SP Bolted'!A166,IF($I$3=$M$5,'SP Welded'!A166,\"\")))","v":"W16X100"},{"$f":"IF($I$3=$M$3,'SP Plus Bolted'!B166,IF($I$3=$M$4,'SP Bolted'!B166,IF($I$3=$M$5,'SP Welded'!B166,\"\")))","v":15},{"$f":"IF($I$3=$M$3,'SP Plus Bolted'!C166,IF($I$3=$M$4,'SP Bolted'!C166,IF($I$3=$M$5,'SP Welded'!C166,\"\")))","v":20.5}]
[{"$f":"IF($I$3=$M$3,'SP Plus Bolted'!A167,IF($I$3=$M$4,'SP Bolted'!A167,IF($I$3=$M$5,'SP Welded'!A167,\"\")))","v":"W16X89"},{"$f":"IF($I$3=$M$3,'SP Plus Bolted'!B167,IF($I$3=$M$4,'SP Bolted'!B167,IF($I$3=$M$5,'SP Welded'!B167,\"\")))","v":15},{"$f":"IF($I$3=$M$3,'SP Plus Bolted'!C167,IF($I$3=$M$4,'SP Bolted'!C167,IF($I$3=$M$5,'SP Welded'!C167,\"\")))","v":20.5}]
[{"$f":"IF($I$3=$M$3,'SP Plus Bolted'!A168,IF($I$3=$M$4,'SP Bolted'!A168,IF($I$3=$M$5,'SP Welded'!A168,\"\")))","v":"W16X77"},{"$f":"IF($I$3=$M$3,'SP Plus Bolted'!B168,IF($I$3=$M$4,'SP Bolted'!B168,IF($I$3=$M$5,'SP Welded'!B168,\"\")))","v":15},{"$f":"IF($I$3=$M$3,'SP Plus Bolted'!C168,IF($I$3=$M$4,'SP Bolted'!C168,IF($I$3=$M$5,'SP Welded'!C168,\"\")))","v":20}]
[{"$f":"IF($I$3=$M$3,'SP Plus Bolted'!A169,IF($I$3=$M$4,'SP Bolted'!A169,IF($I$3=$M$5,'SP Welded'!A169,\"\")))","v":"W16X67"},{"$f":"IF($I$3=$M$3,'SP Plus Bolted'!B169,IF($I$3=$M$4,'SP Bolted'!B169,IF($I$3=$M$5,'SP Welded'!B169,\"\")))","v":14},{"$f":"IF($I$3=$M$3,'SP Plus Bolted'!C169,IF($I$3=$M$4,'SP Bolted'!C169,IF($I$3=$M$5,'SP Welded'!C169,\"\")))","v":20}]
[{"$f":"IF($I$3=$M$3,'SP Plus Bolted'!A170,IF($I$3=$M$4,'SP Bolted'!A170,IF($I$3=$M$5,'SP Welded'!A170,\"\")))","v":"W16X57"},{"$f":"IF($I$3=$M$3,'SP Plus Bolted'!B170,IF($I$3=$M$4,'SP Bolted'!B170,IF($I$3=$M$5,'SP Welded'!B170,\"\")))","v":14},{"$f":"IF($I$3=$M$3,'SP Plus Bolted'!C170,IF($I$3=$M$4,'SP Bolted'!C170,IF($I$3=$M$5,'SP Welded'!C170,\"\")))","v":20}]
[{"$f":"IF($I$3=$M$3,'SP Plus Bolted'!A171,IF($I$3=$M$4,'SP Bolted'!A171,IF($I$3=$M$5,'SP Welded'!A171,\"\")))","v":"W16X50"},{"$f":"IF($I$3=$M$3,'SP Plus Bolted'!B171,IF($I$3=$M$4,'SP Bolted'!B171,IF($I$3=$M$5,'SP Welded'!B171,\"\")))","v":14},{"$f":"IF($I$3=$M$3,'SP Plus Bolted'!C171,IF($I$3=$M$4,'SP Bolted'!C171,IF($I$3=$M$5,'SP Welded'!C171,\"\")))","v":20}]
[{"$f":"IF($I$3=$M$3,'SP Plus Bolted'!A172,IF($I$3=$M$4,'SP Bolted'!A172,IF($I$3=$M$5,'SP Welded'!A172,\"\")))","v":"W16X45"},{"$f":"IF($I$3=$M$3,'SP Plus Bolted'!B172,IF($I$3=$M$4,'SP Bolted'!B172,IF($I$3=$M$5,'SP Welded'!B172,\"\")))","v":14},{"$f":"IF($I$3=$M$3,'SP Plus Bolted'!C172,IF($I$3=$M$4,'SP Bolted'!C172,IF($I$3=$M$5,'SP Welded'!C172,\"\")))","v":20}]
[{"$f":"IF($I$3=$M$3,'SP Plus Bolted'!A173,IF($I$3=$M$4,'SP Bolted'!A173,IF($I$3=$M$5,'SP Welded'!A173,\"\")))","v":"W16X40"},{"$f":"IF($I$3=$M$3,'SP Plus Bolted'!B173,IF($I$3=$M$4,'SP Bolted'!B173,IF($I$3=$M$5,'SP Welded'!B173,\"\")))","v":14},{"$f":"IF($I$3=$M$3,'SP Plus Bolted'!C173,IF($I$3=$M$4,'SP Bolted'!C173,IF($I$3=$M$5,'SP Welded'!C173,\"\")))","v":19.5}]
[{"$f":"IF($I$3=$M$3,'SP Plus Bolted'!A174,IF($I$3=$M$4,'SP Bolted'!A174,IF($I$3=$M$5,'SP Welded'!A174,\"\")))","v":"W16X36"},{"$f":"IF($I$3=$M$3,'SP Plus Bolted'!B174,IF($I$3=$M$4,'SP Bolted'!B174,IF($I$3=$M$5,'SP Welded'!B174,\"\")))","v":14},{"$f":"IF($I$3=$M$3,'SP Plus Bolted'!C174,IF($I$3=$M$4,'SP Bolted'!C174,IF($I$3=$M$5,'SP Welded'!C174,\"\")))","v":19.5}]
[{"$f":"IF($I$3=$M$3,'SP Plus Bolted'!A175,IF($I$3=$M$4,'SP Bolted'!A175,IF($I$3=$M$5,'SP Welded'!A175,\"\")))","v":"W16X31"},{"$f":"IF($I$3=$M$3,'SP Plus Bolted'!B175,IF($I$3=$M$4,'SP Bolted'!B175,IF($I$3=$M$5,'SP Welded'!B175,\"\")))","v":14},{"$f":"IF($I$3=$M$3,'SP Plus Bolted'!C175,IF($I$3=$M$4,'SP Bolted'!C175,IF($I$3=$M$5,'SP Welded'!C175,\"\")))","v":19.5}]
[{"$f":"IF($I$3=$M$3,'SP Plus Bolted'!A176,IF($I$3=$M$4,'SP Bolted'!A176,IF($I$3=$M$5,'SP Welded'!A176,\"\")))","v":"W16X26"},{"$f":"IF($I$3=$M$3,'SP Plus Bolted'!B176,IF($I$3=$M$4,'SP Bolted'!B176,IF($I$3=$M$5,'SP Welded'!B176,\"\")))","v":14},{"$f":"IF($I$3=$M$3,'SP Plus Bolted'!C176,IF($I$3=$M$4,'SP Bolted'!C176,IF($I$3=$M$5,'SP Welded'!C176,\"\")))","v":19.5}]
[{"$f":"IF($I$3=$M$3,'SP Plus Bolted'!A177,IF($I$3=$M$4,'SP Bolted'!A177,IF($I$3=$M$5,'SP Welded'!A177,\"\")))","v":"W14X873"},{"$f":"IF($I$3=$M$3,'SP Plus Bolted'!B177,IF($I$3=$M$4,'SP Bolted'!B177,IF($I$3=$M$5,'SP Welded'!B177,\"\")))","v":21},{"$f":"IF($I$3=$M$3,'SP Plus Bolted'!C177,IF($I$3=$M$4,'SP Bolted'!C177,IF($I$3=$M$5,'SP Welded'!C177,\"\")))","v":27.5}]
[{"$f":"IF($I$3=$M$3,'SP Plus Bolted'!A178,IF($I$3=$M$4,'SP Bolted'!A178,IF($I$3=$M$5,'SP Welded'!A178,\"\")))","v":"W14X808"},{"$f":"IF($I$3=$M$3,'SP Plus Bolted'!B178,IF($I$3=$M$4,'SP Bolted'!B178,IF($I$3=$M$5,'SP Welded'!B178,\"\")))","v":20},{"$f":"IF($I$3=$M$3,'SP Plus Bolted'!C178,IF($I$3=$M$4,'SP Bolted'!C178,IF($I$3=$M$5,'SP Welded'!C178,\"\")))","v":26.5}]
[{"$f":"IF($I$3=$M$3,'SP Plus Bolted'!A179,IF($I$3=$M$4,'SP Bolted'!A179,IF($I$3=$M$5,'SP Welded'!A179,\"\")))","v":"W14X730"},{"$f":"IF($I$3=$M$3,'SP Plus Bolted'!B179,IF($I$3=$M$4,'SP Bolted'!B179,IF($I$3=$M$5,'SP Welded'!B179,\"\")))","v":20},{"$f":"IF($I$3=$M$3,'SP Plus Bolted'!C179,IF($I$3=$M$4,'SP Bolted'!C179,IF($I$3=$M$5,'SP Welded'!C179,\"\")))","v":26}]
[{"$f":"IF($I$3=$M$3,'SP Plus Bolted'!A180,IF($I$3=$M$4,'SP Bolted'!A180,IF($I$3=$M$5,'SP Welded'!A180,\"\")))","v":"W14X665"},{"$f":"IF($I$3=$M$3,'SP Plus Bolted'!B180,IF($I$3=$M$4,'SP Bolted'!B180,IF($I$3=$M$5,'SP Welded'!B180,\"\")))","v":19},{"$f":"IF($I$3=$M$3,'SP Plus Bolted'!C180,IF($I$3=$M$4,'SP Bolted'!C180,IF($I$3=$M$5,'SP Welded'!C180,\"\")))","v":25.5}]
[{"$f":"IF($I$3=$M$3,'SP Plus Bolted'!A181,IF($I$3=$M$4,'SP Bolted'!A181,IF($I$3=$M$5,'SP Welded'!A181,\"\")))","v":"W14X605"},{"$f":"IF($I$3=$M$3,'SP Plus Bolted'!B181,IF($I$3=$M$4,'SP Bolted'!B181,IF($I$3=$M$5,'SP Welded'!B181,\"\")))","v":18},{"$f":"IF($I$3=$M$3,'SP Plus Bolted'!C181,IF($I$3=$M$4,'SP Bolted'!C181,IF($I$3=$M$5,'SP Welded'!C181,\"\")))","v":24.5}]
[{"$f":"IF($I$3=$M$3,'SP Plus Bolted'!A182,IF($I$3=$M$4,'SP Bolted'!A182,IF($I$3=$M$5,'SP Welded'!A182,\"\")))","v":"W14X550"},{"$f":"IF($I$3=$M$3,'SP Plus Bolted'!B182,IF($I$3=$M$4,'SP Bolted'!B182,IF($I$3=$M$5,'SP Welded'!B182,\"\")))","v":18},{"$f":"IF($I$3=$M$3,'SP Plus Bolted'!C182,IF($I$3=$M$4,'SP Bolted'!C182,IF($I$3=$M$5,'SP Welded'!C182,\"\")))","v":24}]
[{"$f":"IF($I$3=$M$3,'SP Plus Bolted'!A183,IF($I$3=$M$4,'SP Bolted'!A183,IF($I$3=$M$5,'SP Welded'!A183,\"\")))","v":"W14X500"},{"$f":"IF($I$3=$M$3,'SP Plus Bolted'!B183,IF($I$3=$M$4,'SP Bolted'!B183,IF($I$3=$M$5,'SP Welded'!B183,\"\")))","v":17},{"$f":"IF($I$3=$M$3,'SP Plus Bolted'!C183,IF($I$3=$M$4,'SP Bolted'!C183,IF($I$3=$M$5,'SP Welded'!C183,\"\")))","v":23.5}]
[{"$f":"IF($I$3=$M$3,'SP Plus Bolted'!A184,IF($I$3=$M$4,'SP Bolted'!A184,IF($I$3=$M$5,'SP Welded'!A184,\"\")))","v":"W14X455"},{"$f":"IF($I$3=$M$3,'SP Plus Bolted'!B184,IF($I$3=$M$4,'SP Bolted'!B184,IF($I$3=$M$5,'SP Welded'!B184,\"\")))","v":17},{"$f":"IF($I$3=$M$3,'SP Plus Bolted'!C184,IF($I$3=$M$4,'SP Bolted'!C184,IF($I$3=$M$5,'SP Welded'!C184,\"\")))","v":22.5}]
[{"$f":"IF($I$3=$M$3,'SP Plus Bolted'!A185,IF($I$3=$M$4,'SP Bolted'!A185,IF($I$3=$M$5,'SP Welded'!A185,\"\")))","v":"W14X426"},{"$f":"IF($I$3=$M$3,'SP Plus Bolted'!B185,IF($I$3=$M$4,'SP Bolted'!B185,IF($I$3=$M$5,'SP Welded'!B185,\"\")))","v":16},{"$f":"IF($I$3=$M$3,'SP Plus Bolted'!C185,IF($I$3=$M$4,'SP Bolted'!C185,IF($I$3=$M$5,'SP Welded'!C185,\"\")))","v":22.5}]
[{"$f":"IF($I$3=$M$3,'SP Plus Bolted'!A186,IF($I$3=$M$4,'SP Bolted'!A186,IF($I$3=$M$5,'SP Welded'!A186,\"\")))","v":"W14X398"},{"$f":"IF($I$3=$M$3,'SP Plus Bolted'!B186,IF($I$3=$M$4,'SP Bolted'!B186,IF($I$3=$M$5,'SP Welded'!B186,\"\")))","v":16},{"$f":"IF($I$3=$M$3,'SP Plus Bolted'!C186,IF($I$3=$M$4,'SP Bolted'!C186,IF($I$3=$M$5,'SP Welded'!C186,\"\")))","v":22}]
[{"$f":"IF($I$3=$M$3,'SP Plus Bolted'!A187,IF($I$3=$M$4,'SP Bolted'!A187,IF($I$3=$M$5,'SP Welded'!A187,\"\")))","v":"W14X370"},{"$f":"IF($I$3=$M$3,'SP Plus Bolted'!B187,IF($I$3=$M$4,'SP Bolted'!B187,IF($I$3=$M$5,'SP Welded'!B187,\"\")))","v":16},{"$f":"IF($I$3=$M$3,'SP Plus Bolted'!C187,IF($I$3=$M$4,'SP Bolted'!C187,IF($I$3=$M$5,'SP Welded'!C187,\"\")))","v":21.5}]
[{"$f":"IF($I$3=$M$3,'SP Plus Bolted'!A188,IF($I$3=$M$4,'SP Bolted'!A188,IF($I$3=$M$5,'SP Welded'!A188,\"\")))","v":"W14X342"},{"$f":"IF($I$3=$M$3,'SP Plus Bolted'!B188,IF($I$3=$M$4,'SP Bolted'!B188,IF($I$3=$M$5,'SP Welded'!B188,\"\")))","v":15},{"$f":"IF($I$3=$M$3,'SP Plus Bolted'!C188,IF($I$3=$M$4,'SP Bolted'!C188,IF($I$3=$M$5,'SP Welded'!C188,\"\")))","v":21}]
[{"$f":"IF($I$3=$M$3,'SP Plus Bolted'!A189,IF($I$3=$M$4,'SP Bolted'!A189,IF($I$3=$M$5,'SP Welded'!A189,\"\")))","v":"W14X311"},{"$f":"IF($I$3=$M$3,'SP Plus Bolted'!B189,IF($I$3=$M$4,'SP Bolted'!B189,IF($I$3=$M$5,'SP Welded'!B189,\"\")))","v":15},{"$f":"IF($I$3=$M$3,'SP Plus Bolted'!C189,IF($I$3=$M$4,'SP Bolted'!C189,IF($I$3=$M$5,'SP Welded'!C189,\"\")))","v":21}]
[{"$f":"IF($I$3=$M$3,'SP Plus Bolted'!A190,IF($I$3=$M$4,'SP Bolted'!A190,IF($I$3=$M$5,'SP Welded'!A190,\"\")))","v":"W14X283"},{"$f":"IF($I$3=$M$3,'SP Plus Bolted'!B190,IF($I$3=$M$4,'SP Bolted'!B190,IF($I$3=$M$5,'SP Welded'!B190,\"\")))","v":15},{"$f":"IF($I$3=$M$3,'SP Plus Bolted'!C190,IF($I$3=$M$4,'SP Bolted'!C190,IF($I$3=$M$5,'SP Welded'!C190,\"\")))","v":20.5}]
[{"$f":"IF($I$3=$M$3,'SP Plus Bolted'!A191,IF($I$3=$M$4,'SP Bolted'!A191,IF($I$3=$M$5,'SP Welded'!A191,\"\")))","v":"W14X257"},{"$f":"IF($I$3=$M$3,'SP Plus Bolted'!B191,IF($I$3=$M$4,'SP Bolted'!B191,IF($I$3=$M$5,'SP Welded'!B191,\"\")))","v":14},{"$f":"IF($I$3=$M$3,'SP Plus Bolted'!C191,IF($I$3=$M$4,'SP Bolted'!C191,IF($I$3=$M$5,'SP Welded'!C191,\"\")))","v":20}]
[{"$f":"IF($I$3=$M$3,'SP Plus Bolted'!A192,IF($I$3=$M$4,'SP Bolted'!A192,IF($I$3=$M$5,'SP Welded'!A192,\"\")))","v":"W14X233"},{"$f":"IF($I$3=$M$3,'SP Plus Bolted'!B192,IF($I$3=$M$4,'SP Bolted'!B192,IF($I$3=$M$5,'SP Welded'!B192,\"\")))","v":14},{"$f":"IF($I$3=$M$3,'SP Plus Bolted'!C192,IF($I$3=$M$4,'SP Bolted'!C192,IF($I$3=$M$5,'SP Welded'!C192,\"\")))","v":19.5}]
[{"$f":"IF($I$3=$M$3,'SP Plus Bolted'!A193,IF($I$3=$M$4,'SP Bolted'!A193,IF($I$3=$M$5,'SP Welded'!A193,\"\")))","v":"W14X211"},{"$f":"IF($I$3=$M$3,'SP Plus Bolted'!B193,IF($I$3=$M$4,'SP Bolted'!B193,IF($I$3=$M$5,'SP Welded'!B193,\"\")))","v":14},{"$f":"IF($I$3=$M$3,'SP Plus Bolted'!C193,IF($I$3=$M$4,'SP Bolted'!C193,IF($I$3=$M$5,'SP Welded'!C193,\"\")))","v":19.5}]
[{"$f":"IF($I$3=$M$3,'SP Plus Bolted'!A194,IF($I$3=$M$4,'SP Bolted'!A194,IF($I$3=$M$5,'SP Welded'!A194,\"\")))","v":"W14X193"},{"$f":"IF($I$3=$M$3,'SP Plus Bolted'!B194,IF($I$3=$M$4,'SP Bolted'!B194,IF($I$3=$M$5,'SP Welded'!B194,\"\")))","v":14},{"$f":"IF($I$3=$M$3,'SP Plus Bolted'!C194,IF($I$3=$M$4,'SP Bolted'!C194,IF($I$3=$M$5,'SP Welded'!C194,\"\")))","v":19}]
[{"$f":"IF($I$3=$M$3,'SP Plus Bolted'!A195,IF($I$3=$M$4,'SP Bolted'!A195,IF($I$3=$M$5,'SP Welded'!A195,\"\")))","v":"W14X176"},{"$f":"IF($I$3=$M$3,'SP Plus Bolted'!B195,IF($I$3=$M$4,'SP Bolted'!B195,IF($I$3=$M$5,'SP Welded'!B195,\"\")))","v":13},{"$f":"IF($I$3=$M$3,'SP Plus Bolted'!C195,IF($I$3=$M$4,'SP Bolted'!C195,IF($I$3=$M$5,'SP Welded'!C195,\"\")))","v":19}]
[{"$f":"IF($I$3=$M$3,'SP Plus Bolted'!A196,IF($I$3=$M$4,'SP Bolted'!A196,IF($I$3=$M$5,'SP Welded'!A196,\"\")))","v":"W14X159"},{"$f":"IF($I$3=$M$3,'SP Plus Bolted'!B196,IF($I$3=$M$4,'SP Bolted'!B196,IF($I$3=$M$5,'SP Welded'!B196,\"\")))","v":13},{"$f":"IF($I$3=$M$3,'SP Plus Bolted'!C196,IF($I$3=$M$4,'SP Bolted'!C196,IF($I$3=$M$5,'SP Welded'!C196,\"\")))","v":18.5}]
[{"$f":"IF($I$3=$M$3,'SP Plus Bolted'!A197,IF($I$3=$M$4,'SP Bolted'!A197,IF($I$3=$M$5,'SP Welded'!A197,\"\")))","v":"W14X145"},{"$f":"IF($I$3=$M$3,'SP Plus Bolted'!B197,IF($I$3=$M$4,'SP Bolted'!B197,IF($I$3=$M$5,'SP Welded'!B197,\"\")))","v":13},{"$f":"IF($I$3=$M$3,'SP Plus Bolted'!C197,IF($I$3=$M$4,'SP Bolted'!C197,IF($I$3=$M$5,'SP Welded'!C197,\"\")))","v":18.5}]
[{"$f":"IF($I$3=$M$3,'SP Plus Bolted'!A198,IF($I$3=$M$4,'SP Bolted'!A198,IF($I$3=$M$5,'SP Welded'!A198,\"\")))","v":"W14X132"},{"$f":"IF($I$3=$M$3,'SP Plus Bolted'!B198,IF($I$3=$M$4,'SP Bolted'!B198,IF($I$3=$M$5,'SP Welded'!B198,\"\")))","v":13},{"$f":"IF($I$3=$M$3,'SP Plus Bolted'!C198,IF($I$3=$M$4,'SP Bolted'!C198,IF($I$3=$M$5,'SP Welded'!C198,\"\")))","v":18.5}]
[{"$f":"IF($I$3=$M$3,'SP Plus Bolted'!A199,IF($I$3=$M$4,'SP Bolted'!A199,IF($I$3=$M$5,'SP Welded'!A199,\"\")))","v":"W14X120"},{"$f":"IF($I$3=$M$3,'SP Plus Bolted'!B199,IF($I$3=$M$4,'SP Bolted'!B199,IF($I$3=$M$5,'SP Welded'!B199,\"\")))","v":13},{"$f":"IF($I$3=$M$3,'SP Plus Bolted'!C199,IF($I$3=$M$4,'SP Bolted'!C199,IF($I$3=$M$5,'SP Welded'!C199,\"\")))","v":18}]
[{"$f":"IF($I$3=$M$3,'SP Plus Bolted'!A200,IF($I$3=$M$4,'SP Bolted'!A200,IF($I$3=$M$5,'SP Welded'!A200,\"\")))","v":"W14X109"},{"$f":"IF($I$3=$M$3,'SP Plus Bolted'!B200,IF($I$3=$M$4,'SP Bolted'!B200,IF($I$3=$M$5,'SP Welded'!B200,\"\")))","v":13},{"$f":"IF($I$3=$M$3,'SP Plus Bolted'!C200,IF($I$3=$M$4,'SP Bolted'!C200,IF($I$3=$M$5,'SP Welded'!C200,\"\")))","v":18}]
[{"$f":"IF($I$3=$M$3,'SP Plus Bolted'!A201,IF($I$3=$M$4,'SP Bolted'!A201,IF($I$3=$M$5,'SP Welded'!A201,\"\")))","v":"W14X99"},{"$f":"IF($I$3=$M$3,'SP Plus Bolted'!B201,IF($I$3=$M$4,'SP Bolted'!B201,IF($I$3=$M$5,'SP Welded'!B201,\"\")))","v":13},{"$f":"IF($I$3=$M$3,'SP Plus Bolted'!C201,IF($I$3=$M$4,'SP Bolted'!C201,IF($I$3=$M$5,'SP Welded'!C201,\"\")))","v":18}]
[{"$f":"IF($I$3=$M$3,'SP Plus Bolted'!A202,IF($I$3=$M$4,'SP Bolted'!A202,IF($I$3=$M$5,'SP Welded'!A202,\"\")))","v":"W14X90"},{"$f":"IF($I$3=$M$3,'SP Plus Bolted'!B202,IF($I$3=$M$4,'SP Bolted'!B202,IF($I$3=$M$5,'SP Welded'!B202,\"\")))","v":12},{"$f":"IF($I$3=$M$3,'SP Plus Bolted'!C202,IF($I$3=$M$4,'SP Bolted'!C202,IF($I$3=$M$5,'SP Welded'!C202,\"\")))","v":17.5}]
[{"$f":"IF($I$3=$M$3,'SP Plus Bolted'!A203,IF($I$3=$M$4,'SP Bolted'!A203,IF($I$3=$M$5,'SP Welded'!A203,\"\")))","v":"W14X82"},{"$f":"IF($I$3=$M$3,'SP Plus Bolted'!B203,IF($I$3=$M$4,'SP Bolted'!B203,IF($I$3=$M$5,'SP Welded'!B203,\"\")))","v":13},{"$f":"IF($I$3=$M$3,'SP Plus Bolted'!C203,IF($I$3=$M$4,'SP Bolted'!C203,IF($I$3=$M$5,'SP Welded'!C203,\"\")))","v":18}]
[{"$f":"IF($I$3=$M$3,'SP Plus Bolted'!A204,IF($I$3=$M$4,'SP Bolted'!A204,IF($I$3=$M$5,'SP Welded'!A204,\"\")))","v":"W14X74"},{"$f":"IF($I$3=$M$3,'SP Plus Bolted'!B204,IF($I$3=$M$4,'SP Bolted'!B204,IF($I$3=$M$5,'SP Welded'!B204,\"\")))","v":13},{"$f":"IF($I$3=$M$3,'SP Plus Bolted'!C204,IF($I$3=$M$4,'SP Bolted'!C204,IF($I$3=$M$5,'SP Welded'!C204,\"\")))","v":18}]
[{"$f":"IF($I$3=$M$3,'SP Plus Bolted'!A205,IF($I$3=$M$4,'SP Bolted'!A205,IF($I$3=$M$5,'SP Welded'!A205,\"\")))","v":"W14X68"},{"$f":"IF($I$3=$M$3,'SP Plus Bolted'!B205,IF($I$3=$M$4,'SP Bolted'!B205,IF($I$3=$M$5,'SP Welded'!B205,\"\")))","v":12},{"$f":"IF($I$3=$M$3,'SP Plus Bolted'!C205,IF($I$3=$M$4,'SP Bolted'!C205,IF($I$3=$M$5,'SP Welded'!C205,\"\")))","v":17.5}]
[{"$f":"IF($I$3=$M$3,'SP Plus Bolted'!A206,IF($I$3=$M$4,'SP Bolted'!A206,IF($I$3=$M$5,'SP Welded'!A206,\"\")))","v":"W14X61"},{"$f":"IF($I$3=$M$3,'SP Plus Bolted'!B206,IF($I$3=$M$4,'SP Bolted'!B206,IF($I$3=$M$5,'SP Welded'!B206,\"\")))","v":12},{"$f":"IF($I$3=$M$3,'SP Plus Bolted'!C206,IF($I$3=$M$4,'SP Bolted'!C206,IF($I$3=$M$5,'SP Welded'!C206,\"\")))","v":17.5}]
[{"$f":"IF($I$3=$M$3,'SP Plus Bolted'!A207,IF($I$3=$M$4,'SP Bolted'!A207,IF($I$3=$M$5,'SP Welded'!A207,\"\")))","v":"W14X53"},{"$f":"IF($I$3=$M$3,'SP Plus Bolted'!B207,IF($I$3=$M$4,'SP Bolted'!B207,IF($I$3=$M$5,'SP Welded'!B207,\"\")))","v":12},{"$f":"IF($I$3=$M$3,'SP Plus Bolted'!C207,IF($I$3=$M$4,'SP Bolted'!C207,IF($I$3=$M$5,'SP Welded'!C207,\"\")))","v":17.5}]
[{"$f":"IF($I$3=$M$3,'SP Plus Bolted'!A208,IF($I$3=$M$4,'SP Bolted'!A208,IF($I$3=$M$5,'SP Welded'!A208,\"\")))","v":"W14X48"},{"$f":"IF($I$3=$M$3,'SP Plus Bolted'!B208,IF($I$3=$M$4,'SP Bolted'!B208,IF($I$3=$M$5,'SP Welded'!B208,\"\")))","v":12},{"$f":"IF($I$3=$M$3,'SP Plus Bolted'!C208,IF($I$3=$M$4,'SP Bolted'!C208,IF($I$3=$M$5,'SP Welded'!C208,\"\")))","v":17.5}]
[{"$f":"IF($I$3=$M$3,'SP Plus Bolted'!A209,IF($I$3=$M$4,'SP Bolted'!A209,IF($I$3=$M$5,'SP Welded'!A209,\"\")))","v":"W14X43"},{"$f":"IF($I$3=$M$3,'SP Plus Bolted'!B209,IF($I$3=$M$4,'SP Bolted'!B209,IF($I$3=$M$5,'SP Welded'!B209,\"\")))","v":12},{"$f":"IF($I$3=$M$3,'SP Plus Bolted'!C209,IF($I$3=$M$4,'SP Bolted'!C209,IF($I$3=$M$5,'SP Welded'!C209,\"\")))","v":17.5}]
[{"$f":"IF($I$3=$M$3,'SP Plus Bolted'!A210,IF($I$3=$M$4,'SP Bolted'!A210,IF($I$3=$M$5,'SP Welded'!A210,\"\")))","v":"W14X38"},{"$f":"IF($I$3=$M$3,'SP Plus Bolted'!B210,IF($I$3=$M$4,'SP Bolted'!B210,IF($I$3=$M$5,'SP Welded'!B210,\"\")))","v":13},{"$f":"IF($I$3=$M$3,'SP Plus Bolted'!C210,IF($I$3=$M$4,'SP Bolted'!C210,IF($I$3=$M$5,'SP Welded'!C210,\"\")))","v":18}]
[{"$f":"IF($I$3=$M$3,'SP Plus Bolted'!A211,IF($I$3=$M$4,'SP Bolted'!A211,IF($I$3=$M$5,'SP Welded'!A211,\"\")))","v":"W14X34"},{"$f":"IF($I$3=$M$3,'SP Plus Bolted'!B211,IF($I$3=$M$4,'SP Bolted'!B211,IF($I$3=$M$5,'SP Welded'!B211,\"\")))","v":12},{"$f":"IF($I$3=$M$3,'SP Plus Bolted'!C211,IF($I$3=$M$4,'SP Bolted'!C211,IF($I$3=$M$5,'SP Welded'!C211,\"\")))","v":17.5}]
[{"$f":"IF($I$3=$M$3,'SP Plus Bolted'!A212,IF($I$3=$M$4,'SP Bolted'!A212,IF($I$3=$M$5,'SP Welded'!A212,\"\")))","v":"W14X30"},{"$f":"IF($I$3=$M$3,'SP Plus Bolted'!B212,IF($I$3=$M$4,'SP Bolted'!B212,IF($I$3=$M$5,'SP Welded'!B212,\"\")))","v":12},{"$f":"IF($I$3=$M$3,'SP Plus Bolted'!C212,IF($I$3=$M$4,'SP Bolted'!C212,IF($I$3=$M$5,'SP Welded'!C212,\"\")))","v":17.5}]
[{"$f":"IF($I$3=$M$3,'SP Plus Bolted'!A213,IF($I$3=$M$4,'SP Bolted'!A213,IF($I$3=$M$5,'SP Welded'!A213,\"\")))","v":"W14X26"},{"$f":"IF($I$3=$M$3,'SP Plus Bolted'!B213,IF($I$3=$M$4,'SP Bolted'!B213,IF($I$3=$M$5,'SP Welded'!B213,\"\")))","v":12},{"$f":"IF($I$3=$M$3,'SP Plus Bolted'!C213,IF($I$3=$M$4,'SP Bolted'!C213,IF($I$3=$M$5,'SP Welded'!C213,\"\")))","v":17.5}]
[{"$f":"IF($I$3=$M$3,'SP Plus Bolted'!A214,IF($I$3=$M$4,'SP Bolted'!A214,IF($I$3=$M$5,'SP Welded'!A214,\"\")))","v":"W14X22"},{"$f":"IF($I$3=$M$3,'SP Plus Bolted'!B214,IF($I$3=$M$4,'SP Bolted'!B214,IF($I$3=$M$5,'SP Welded'!B214,\"\")))","v":12},{"$f":"IF($I$3=$M$3,'SP Plus Bolted'!C214,IF($I$3=$M$4,'SP Bolted'!C214,IF($I$3=$M$5,'SP Welded'!C214,\"\")))","v":17.5}]
[{"$f":"IF($I$3=$M$3,'SP Plus Bolted'!A215,IF($I$3=$M$4,'SP Bolted'!A215,IF($I$3=$M$5,'SP Welded'!A215,\"\")))","v":"W12X336"},{"$f":"IF($I$3=$M$3,'SP Plus Bolted'!B215,IF($I$3=$M$4,'SP Bolted'!B215,IF($I$3=$M$5,'SP Welded'!B215,\"\")))","v":15},{"$f":"IF($I$3=$M$3,'SP Plus Bolted'!C215,IF($I$3=$M$4,'SP Bolted'!C215,IF($I$3=$M$5,'SP Welded'!C215,\"\")))","v":20.5}]
[{"$f":"IF($I$3=$M$3,'SP Plus Bolted'!A216,IF($I$3=$M$4,'SP Bolted'!A216,IF($I$3=$M$5,'SP Welded'!A216,\"\")))","v":"W12X305"},{"$f":"IF($I$3=$M$3,'SP Plus Bolted'!B216,IF($I$3=$M$4,'SP Bolted'!B216,IF($I$3=$M$5,'SP Welded'!B216,\"\")))","v":14},{"$f":"IF($I$3=$M$3,'SP Plus Bolted'!C216,IF($I$3=$M$4,'SP Bolted'!C216,IF($I$3=$M$5,'SP Welded'!C216,\"\")))","v":20}]
[{"$f":"IF($I$3=$M$3,'SP Plus Bolted'!A217,IF($I$3=$M$4,'SP Bolted'!A217,IF($I$3=$M$5,'SP Welded'!A217,\"\")))","v":"W12X279"},{"$f":"IF($I$3=$M$3,'SP Plus Bolted'!B217,IF($I$3=$M$4,'SP Bolted'!B217,IF($I$3=$M$5,'SP Welded'!B217,\"\")))","v":14},{"$f":"IF($I$3=$M$3,'SP Plus Bolted'!C217,IF($I$3=$M$4,'SP Bolted'!C217,IF($I$3=$M$5,'SP Welded'!C217,\"\")))","v":19.5}]
[{"$f":"IF($I$3=$M$3,'SP Plus Bolted'!A218,IF($I$3=$M$4,'SP Bolted'!A218,IF($I$3=$M$5,'SP Welded'!A218,\"\")))","v":"W12X252"},{"$f":"IF($I$3=$M$3,'SP Plus Bolted'!B218,IF($I$3=$M$4,'SP Bolted'!B218,IF($I$3=$M$5,'SP Welded'!B218,\"\")))","v":14},{"$f":"IF($I$3=$M$3,'SP Plus Bolted'!C218,IF($I$3=$M$4,'SP Bolted'!C218,IF($I$3=$M$5,'SP Welded'!C218,\"\")))","v":19}]
[{"$f":"IF($I$3=$M$3,'SP Plus Bolted'!A219,IF($I$3=$M$4,'SP Bolted'!A219,IF($I$3=$M$5,'SP Welded'!A219,\"\")))","v":"W12X230"},{"$f":"IF($I$3=$M$3,'SP Plus Bolted'!B219,IF($I$3=$M$4,'SP Bolted'!B219,IF($I$3=$M$5,'SP Welded'!B219,\"\")))","v":13},{"$f":"IF($I$3=$M$3,'SP Plus Bolted'!C219,IF($I$3=$M$4,'SP Bolted'!C219,IF($I$3=$M$5,'SP Welded'!C219,\"\")))","v":18.5}]
[{"$f":"IF($I$3=$M$3,'SP Plus Bolted'!A220,IF($I$3=$M$4,'SP Bolted'!A220,IF($I$3=$M$5,'SP Welded'!A220,\"\")))","v":"W12X210"},{"$f":"IF($I$3=$M$3,'SP Plus Bolted'!B220,IF($I$3=$M$4,'SP Bolted'!B220,IF($I$3=$M$5,'SP Welded'!B220,\"\")))","v":13},{"$f":"IF($I$3=$M$3,'SP Plus Bolted'!C220,IF($I$3=$M$4,'SP Bolted'!C220,IF($I$3=$M$5,'SP Welded'!C220,\"\")))","v":18.5}]
[{"$f":"IF($I$3=$M$3,'SP Plus Bolted'!A221,IF($I$3=$M$4,'SP Bolted'!A221,IF($I$3=$M$5,'SP Welded'!A221,\"\")))","v":"W12X190"},{"$f":"IF($I$3=$M$3,'SP Plus Bolted'!B221,IF($I$3=$M$4,'SP Bolted'!B221,IF($I$3=$M$5,'SP Welded'!B221,\"\")))","v":13},{"$f":"IF($I$3=$M$3,'SP Plus Bolted'!C221,IF($I$3=$M$4,'SP Bolted'!C221,IF($I$3=$M$5,'SP Welded'!C221,\"\")))","v":18}]
[{"$f":"IF($I$3=$M$3,'SP Plus Bolted'!A222,IF($I$3=$M$4,'SP Bolted'!A222,IF($I$3=$M$5,'SP Welded'!A222,\"\")))","v":"W12X170"},{"$f":"IF($I$3=$M$3,'SP Plus Bolted'!B222,IF($I$3=$M$4,'SP Bolted'!B222,IF($I$3=$M$5,'SP Welded'!B222,\"\")))","v":12},{"$f":"IF($I$3=$M$3,'SP Plus Bolted'!C222,IF($I$3=$M$4,'SP Bolted'!C222,IF($I$3=$M$5,'SP Welded'!C222,\"\")))","v":17.5}]
[{"$f":"IF($I$3=$M$3,'SP Plus Bolted'!A223,IF($I$3=$M$4,'SP Bolted'!A223,IF($I$3=$M$5,'SP Welded'!A223,\"\")))","v":"W12X152"},{"$f":"IF($I$3=$M$3,'SP Plus Bolted'!B223,IF($I$3=$M$4,'SP Bolted'!B223,IF($I$3=$M$5,'SP Welded'!B223,\"\")))","v":12},{"$f":"IF($I$3=$M$3,'SP Plus Bolted'!C223,IF($I$3=$M$4,'SP Bolted'!C223,IF($I$3=$M$5,'SP Welded'!C223,\"\")))","v":17.5}]
[{"$f":"IF($I$3=$M$3,'SP Plus Bolted'!A224,IF($I$3=$M$4,'SP Bolted'!A224,IF($I$3=$M$5,'SP Welded'!A224,\"\")))","v":"W12X136"},{"$f":"IF($I$3=$M$3,'SP Plus Bolted'!B224,IF($I$3=$M$4,'SP Bolted'!B224,IF($I$3=$M$5,'SP Welded'!B224,\"\")))","v":12},{"$f":"IF($I$3=$M$3,'SP Plus Bolted'!C224,IF($I$3=$M$4,'SP Bolted'!C224,IF($I$3=$M$5,'SP Welded'!C224,\"\")))","v":17}]
[{"$f":"IF($I$3=$M$3,'SP Plus Bolted'!A225,IF($I$3=$M$4,'SP Bolted'!A225,IF($I$3=$M$5,'SP Welded'!A225,\"\")))","v":"W12X120"},{"$f":"IF($I$3=$M$3,'SP Plus Bolted'!B225,IF($I$3=$M$4,'SP Bolted'!B225,IF($I$3=$M$5,'SP Welded'!B225,\"\")))","v":12},{"$f":"IF($I$3=$M$3,'SP Plus Bolted'!C225,IF($I$3=$M$4,'SP Bolted'!C225,IF($I$3=$M$5,'SP Welded'!C225,\"\")))","v":17}]
[{"$f":"IF($I$3=$M$3,'SP Plus Bolted'!A226,IF($I$3=$M$4,'SP Bolted'!A226,IF($I$3=$M$5,'SP Welded'!A226,\"\")))","v":"W12X106"},{"$f":"IF($I$3=$M$3,'SP Plus Bolted'!B226,IF($I$3=$M$4,'SP Bolted'!B226,IF($I$3=$M$5,'SP Welded'!B226,\"\")))","v":11},{"$f":"IF($I$3=$M$3,'SP Plus Bolted'!C226,IF($I$3=$M$4,'SP Bolted'!C226,IF($I$3=$M$5,'SP Welded'!C226,\"\")))","v":16.5}]
[{"$f":"IF($I$3=$M$3,'SP Plus Bolted'!A227,IF($I$3=$M$4,'SP Bolted'!A227,IF($I$3=$M$5,'SP Welded'!A227,\"\")))","v":"W12X96"},{"$f":"IF($I$3=$M$3,'SP Plus Bolted'!B227,IF($I$3=$M$4,'SP Bolted'!B227,IF($I$3=$M$5,'SP Welded'!B227,\"\")))","v":11},{"$f":"IF($I$3=$M$3,'SP Plus Bolted'!C227,IF($I$3=$M$4,'SP Bolted'!C227,IF($I$3=$M$5,'SP Welded'!C227,\"\")))","v":16.5}]
[{"$f":"IF($I$3=$M$3,'SP Plus Bolted'!A228,IF($I$3=$M$4,'SP Bolted'!A228,IF($I$3=$M$5,'SP Welded'!A228,\"\")))","v":"W12X87"},{"$f":"IF($I$3=$M$3,'SP Plus Bolted'!B228,IF($I$3=$M$4,'SP Bolted'!B228,IF($I$3=$M$5,'SP Welded'!B228,\"\")))","v":11},{"$f":"IF($I$3=$M$3,'SP Plus Bolted'!C228,IF($I$3=$M$4,'SP Bolted'!C228,IF($I$3=$M$5,'SP Welded'!C228,\"\")))","v":16}]
[{"$f":"IF($I$3=$M$3,'SP Plus Bolted'!A229,IF($I$3=$M$4,'SP Bolted'!A229,IF($I$3=$M$5,'SP Welded'!A229,\"\")))","v":"W12X79"},{"$f":"IF($I$3=$M$3,'SP Plus Bolted'!B229,IF($I$3=$M$4,'SP Bolted'!B229,IF($I$3=$M$5,'SP Welded'!B229,\"\")))","v":11},{"$f":"IF($I$3=$M$3,'SP Plus Bolted'!C229,IF($I$3=$M$4,'SP Bolted'!C229,IF($I$3=$M$5,'SP Welded'!C229,\"\")))","v":16}]
[{"$f":"IF($I$3=$M$3,'SP Plus Bolted'!A230,IF($I$3=$M$4,'SP Bolted'!A230,IF($I$3=$M$5,'SP Welded'!A230,\"\")))","v":"W12X72"},{"$f":"IF($I$3=$M$3,'SP Plus Bolted'!B230,IF($I$3=$M$4,'SP Bolted'!B230,IF($I$3=$M$5,'SP Welded'!B230,\"\")))","v":11},{"$f":"IF($I$3=$M$3,'SP Plus Bolted'!C230,IF($I$3=$M$4,'SP Bolted'!C230,IF($I$3=$M$5,'SP Welded'!C230,\"\")))","v":16}]
[{"$f":"IF($I$3=$M$3,'SP Plus Bolted'!A231,IF($I$3=$M$4,'SP Bolted'!A231,IF($I$3=$M$5,'SP Welded'!A231,\"\")))","v":"W12X65"},{"$f":"IF($I$3=$M$3,'SP Plus Bolted'!B231,IF($I$3=$M$4,'SP Bolted'!B231,IF($I$3=$M$5,'SP Welded'!B231,\"\")))","v":11},{"$f":"IF($I$3=$M$3,'SP Plus Bolted'!C231,IF($I$3=$M$4,'SP Bolted'!C231,IF($I$3=$M$5,'SP Welded'!C231,\"\")))","v":16}]
[{"$f":"IF($I$3=$M$3,'SP Plus Bolted'!A232,IF($I$3=$M$4,'SP Bolted'!A232,IF($I$3=$M$5,'SP Welded'!A232,\"\")))","v":"W12X58"},{"$f":"IF($I$3=$M$3,'SP Plus Bolted'!B232,IF($I$3=$M$4,'SP Bolted'!B232,IF($I$3=$M$5,'SP Welded'!B232,\"\")))","v":11},{"$f":"IF($I$3=$M$3,'SP Plus Bolted'!C232,IF($I$3=$M$4,'SP Bolted'!C232,IF($I$3=$M$5,'SP Welded'!C232,\"\")))","v":16}]
[{"$f":"IF($I$3=$M$3,'SP Plus Bolted'!A233,IF($I$3=$M$4,'SP Bolted'!A233,IF($I$3=$M$5,'SP Welded'!A233,\"\")))","v":"W12X53"},{"$f":"IF($I$3=$M$3,'SP Plus Bolted'!B233,IF($I$3=$M$4,'SP Bolted'!B233,IF($I$3=$M$5,'SP Welded'!B233,\"\")))","v":11},{"$f":"IF($I$3=$M$3,'SP Plus Bolted'!C233,IF($I$3=$M$4,'SP Bolted'!C233,IF($I$3=$M$5,'SP Welded'!C233,\"\")))","v":15.5}]
[{"$f":"IF($I$3=$M$3,'SP Plus Bolted'!A234,IF($I$3=$M$4,'SP Bolted'!A234,IF($I$3=$M$5,'SP Welded'!A234,\"\")))","v":"W12X50"},{"$f":"IF($I$3=$M$3,'SP Plus Bolted'!B234,IF($I$3=$M$4,'SP Bolted'!B234,IF($I$3=$M$5,'SP Welded'!B234,\"\")))","v":11},{"$f":"IF($I$3=$M$3,'SP Plus Bolted'!C234,IF($I$3=$M$4,'SP Bolted'!C234,IF($I$3=$M$5,'SP Welded'!C234,\"\")))","v":16}]
[{"$f":"IF($I$3=$M$3,'SP Plus Bolted'!A235,IF($I$3=$M$4,'SP Bolted'!A235,IF($I$3=$M$5,'SP Welded'!A235,\"\")))","v":"W12X45"},{"$f":"IF($I$3=$M$3,'SP Plus Bolted'!B235,IF($I$3=$M$4,'SP Bolted'!B235,IF($I$3=$M$5,'SP Welded'!B235,\"\")))","v":11},{"$f":"IF($I$3=$M$3,'SP Plus Bolted'!C235,IF($I$3=$M$4,'SP Bolted'!C235,IF($I$3=$M$5,'SP Welded'!C235,\"\")))","v":15.5}]
[{"$f":"IF($I$3=$M$3,'SP Plus Bolted'!A236,IF($I$3=$M$4,'SP Bolted'!A236,IF($I$3=$M$5,'SP Welded'!A236,\"\")))","v":"W12X40"},{"$f":"IF($I$3=$M$3,'SP Plus Bolted'!B236,IF($I$3=$M$4,'SP Bolted'!B236,IF($I$3=$M$5,'SP Welded'!B236,\"\")))","v":11},{"$f":"IF($I$3=$M$3,'SP Plus Bolted'!C236,IF($I$3=$M$4,'SP Bolted'!C236,IF($I$3=$M$5,'SP Welded'!C236,\"\")))","v":15.5}]
[{"$f":"IF($I$3=$M$3,'SP Plus Bolted'!A237,IF($I$3=$M$4,'SP Bolted'!A237,IF($I$3=$M$5,'SP Welded'!A237,\"\")))","v":"W12X35"},{"$f":"IF($I$3=$M$3,'SP Plus Bolted'!B237,IF($I$3=$M$4,'SP Bolted'!B237,IF($I$3=$M$5,'SP Welded'!B237,\"\")))","v":11},{"$f":"IF($I$3=$M$3,'SP Plus Bolted'!C237,IF($I$3=$M$4,'SP Bolted'!C237,IF($I$3=$M$5,'SP Welded'!C237,\"\")))","v":16}]
[{"$f":"IF($I$3=$M$3,'SP Plus Bolted'!A238,IF($I$3=$M$4,'SP Bolted'!A238,IF($I$3=$M$5,'SP Welded'!A238,\"\")))","v":"W12X30"},{"$f":"IF($I$3=$M$3,'SP Plus Bolted'!B238,IF($I$3=$M$4,'SP Bolted'!B238,IF($I$3=$M$5,'SP Welded'!B238,\"\")))","v":11},{"$f":"IF($I$3=$M$3,'SP Plus Bolted'!C238,IF($I$3=$M$4,'SP Bolted'!C238,IF($I$3=$M$5,'SP Welded'!C238,\"\")))","v":16}]
[{"$f":"IF($I$3=$M$3,'SP Plus Bolted'!A239,IF($I$3=$M$4,'SP Bolted'!A239,IF($I$3=$M$5,'SP Welded'!A239,\"\")))","v":"W12X26"},{"$f":"IF($I$3=$M$3,'SP Plus Bolted'!B239,IF($I$3=$M$4,'SP Bolted'!B239,IF($I$3=$M$5,'SP Welded'!B239,\"\")))","v":11},{"$f":"IF($I$3=$M$3,'SP Plus Bolted'!C239,IF($I$3=$M$4,'SP Bolted'!C239,IF($I$3=$M$5,'SP Welded'!C239,\"\")))","v":16}]
[{"$f":"IF($I$3=$M$3,'SP Plus Bolted'!A240,IF($I$3=$M$4,'SP Bolted'!A240,IF($I$3=$M$5,'SP Welded'!A240,\"\")))","v":"W12X22"},{"$f":"IF($I$3=$M$3,'SP Plus Bolted'!B240,IF($I$3=$M$4,'SP Bolted'!B240,IF($I$3=$M$5,'SP Welded'!B240,\"\")))","v":11},{"$f":"IF($I$3=$M$3,'SP Plus Bolted'!C240,IF($I$3=$M$4,'SP Bolted'!C240,IF($I$3=$M$5,'SP Welded'!C240,\"\")))","v":16}]
[{"$f":"IF($I$3=$M$3,'SP Plus Bolted'!A241,IF($I$3=$M$4,'SP Bolted'!A241,IF($I$3=$M$5,'SP Welded'!A241,\"\")))","v":"W12X19"},{"$f":"IF($I$3=$M$3,'SP Plus Bolted'!B241,IF($I$3=$M$4,'SP Bolted'!B241,IF($I$3=$M$5,'SP Welded'!B241,\"\")))","v":11},{"$f":"IF($I$3=$M$3,'SP Plus Bolted'!C241,IF($I$3=$M$4,'SP Bolted'!C241,IF($I$3=$M$5,'SP Welded'!C241,\"\")))","v":16}]
[{"$f":"IF($I$3=$M$3,'SP Plus Bolted'!A242,IF($I$3=$M$4,'SP Bolted'!A242,IF($I$3=$M$5,'SP Welded'!A242,\"\")))","v":"W12X16"},{"$f":"IF($I$3=$M$3,'SP Plus Bolted'!B242,IF($I$3=$M$4,'SP Bolted'!B242,IF($I$3=$M$5,'SP Welded'!B242,\"\")))","v":11},{"$f":"IF($I$3=$M$3,'SP Plus Bolted'!C242,IF($I$3=$M$4,'SP Bolted'!C242,IF($I$3=$M$5,'SP Welded'!C242,\"\")))","v":15.5}]
[{"$f":"IF($I$3=$M$3,'SP Plus Bolted'!A243,IF($I$3=$M$4,'SP Bolted'!A243,IF($I$3=$M$5,'SP Welded'!A243,\"\")))","v":"W12X14"},{"$f":"IF($I$3=$M$3,'SP Plus Bolted'!B243,IF($I$3=$M$4,'SP Bolted'!B243,IF($I$3=$M$5,'SP Welded'!B243,\"\")))","v":11},{"$f":"IF($I$3=$M$3,'SP Plus Bolted'!C243,IF($I$3=$M$4,'SP Bolted'!C243,IF($I$3=$M$5,'SP Welded'!C243,\"\")))","v":15.5}]
[{"$f":"IF($I$3=$M$3,'SP Plus Bolted'!A244,IF($I$3=$M$4,'SP Bolted'!A244,IF($I$3=$M$5,'SP Welded'!A244,\"\")))","v":"W10X112"},{"$f":"IF($I$3=$M$3,'SP Plus Bolted'!B244,IF($I$3=$M$4,'SP Bolted'!B244,IF($I$3=$M$5,'SP Welded'!B244,\"\")))","v":11},{"$f":"IF($I$3=$M$3,'SP Plus Bolted'!C244,IF($I$3=$M$4,'SP Bolted'!C244,IF($I$3=$M$5,'SP Welded'!C244,\"\")))","v":15}]
[{"$f":"IF($I$3=$M$3,'SP Plus Bolted'!A245,IF($I$3=$M$4,'SP Bolted'!A245,IF($I$3=$M$5,'SP Welded'!A245,\"\")))","v":"W10X100"},{"$f":"IF($I$3=$M$3,'SP Plus Bolted'!B245,IF($I$3=$M$4,'SP Bolted'!B245,IF($I$3=$M$5,'SP Welded'!B245,\"\")))","v":11},{"$f":"IF($I$3=$M$3,'SP Plus Bolted'!C245,IF($I$3=$M$4,'SP Bolted'!C245,IF($I$3=$M$5,'SP Welded'!C245,\"\")))","v":15}]
[{"$f":"IF($I$3=$M$3,'SP Plus Bolted'!A246,IF($I$3=$M$4,'SP Bolted'!A246,IF($I$3=$M$5,'SP Welded'!A246,\"\")))","v":"W10X88"},{"$f":"IF($I$3=$M$3,'SP Plus Bolted'!B246,IF($I$3=$M$4,'SP Bolted'!B246,IF($I$3=$M$5,'SP Welded'!B246,\"\")))","v":11},{"$f":"IF($I$3=$M$3,'SP Plus Bolted'!C246,IF($I$3=$M$4,'SP Bolted'!C246,IF($I$3=$M$5,'SP Welded'!C246,\"\")))","v":14.5}]
[{"$f":"IF($I$3=$M$3,'SP Plus Bolted'!A247,IF($I$3=$M$4,'SP Bolted'!A247,IF($I$3=$M$5,'SP Welded'!A247,\"\")))","v":"W10X77"},{"$f":"IF($I$3=$M$3,'SP Plus Bolted'!B247,IF($I$3=$M$4,'SP Bolted'!B247,IF($I$3=$M$5,'SP Welded'!B247,\"\")))","v":11},{"$f":"IF($I$3=$M$3,'SP Plus Bolted'!C247,IF($I$3=$M$4,'SP Bolted'!C247,IF($I$3=$M$5,'SP Welded'!C247,\"\")))","v":14.5}]
[{"$f":"IF($I$3=$M$3,'SP Plus Bolted'!A248,IF($I$3=$M$4,'SP Bolted'!A248,IF($I$3=$M$5,'SP Welded'!A248,\"\")))","v":"W10X68"},{"$f":"IF($I$3=$M$3,'SP Plus Bolted'!B248,IF($I$3=$M$4,'SP Bolted'!B248,IF($I$3=$M$5,'SP Welded'!B248,\"\")))","v":11},{"$f":"IF($I$3=$M$3,'SP Plus Bolted'!C248,IF($I$3=$M$4,'SP Bolted'!C248,IF($I$3=$M$5,'SP Welded'!C248,\"\")))","v":14}]
[{"$f":"IF($I$3=$M$3,'SP Plus Bolted'!A249,IF($I$3=$M$4,'SP Bolted'!A249,IF($I$3=$M$5,'SP Welded'!A249,\"\")))","v":"W10X60"},{"$f":"IF($I$3=$M$3,'SP Plus Bolted'!B249,IF($I$3=$M$4,'SP Bolted'!B249,IF($I$3=$M$5,'SP Welded'!B249,\"\")))","v":11},{"$f":"IF($I$3=$M$3,'SP Plus Bolted'!C249,IF($I$3=$M$4,'SP Bolted'!C249,IF($I$3=$M$5,'SP Welded'!C249,\"\")))","v":14}]
[{"$f":"IF($I$3=$M$3,'SP Plus Bolted'!A250,IF($I$3=$M$4,'SP Bolted'!A250,IF($I$3=$M$5,'SP Welded'!A250,\"\")))","v":"W10X54"},{"$f":"IF($I$3=$M$3,'SP Plus Bolted'!B250,IF($I$3=$M$4,'SP Bolted'!B250,IF($I$3=$M$5,'SP Welded'!B250,\"\")))","v":11},{"$f":"IF($I$3=$M$3,'SP Plus Bolted'!C250,IF($I$3=$M$4,'SP Bolted'!C250,IF($I$3=$M$5,'SP Welded'!C250,\"\")))","v":14}]
[{"$f":"IF($I$3=$M$3,'SP Plus Bolted'!A251,IF($I$3=$M$4,'SP Bolted'!A251,IF($I$3=$M$5,'SP Welded'!A251,\"\")))","v":"W10X49"},{"$f":"IF($I$3=$M$3,'SP Plus Bolted'!B251,IF($I$3=$M$4,'SP Bolted'!B251,IF($I$3=$M$5,'SP Welded'!B251,\"\")))","v":11},{"$f":"IF($I$3=$M$3,'SP Plus Bolted'!C251,IF($I$3=$M$4,'SP Bolted'!C251,IF($I$3=$M$5,'SP Welded'!C251,\"\")))","v":13.5}]
[{"$f":"IF($I$3=$M$3,'SP Plus Bolted'!A252,IF($I$3=$M$4,'SP Bolted'!A252,IF($I$3=$M$5,'SP Welded'!A252,\"\")))","v":"W10X45"},{"$f":"IF($I$3=$M$3,'SP Plus Bolted'!B252,IF($I$3=$M$4,'SP Bolted'!B252,IF($I$3=$M$5,'SP Welded'!B252,\"\")))","v":11},{"$f":"IF($I$3=$M$3,'SP Plus Bolted'!C252,IF($I$3=$M$4,'SP Bolted'!C252,IF($I$3=$M$5,'SP Welded'!C252,\"\")))","v":14}]
[{"$f":"IF($I$3=$M$3,'SP Plus Bolted'!A253,IF($I$3=$M$4,'SP Bolted'!A253,IF($I$3=$M$5,'SP Welded'!A253,\"\")))","v":"W10X39"},{"$f":"IF($I$3=$M$3,'SP Plus Bolted'!B253,IF($I$3=$M$4,'SP Bolted'!B253,IF($I$3=$M$5,'SP Welded'!B253,\"\")))","v":11},{"$f":"IF($I$3=$M$3,'SP Plus Bolted'!C253,IF($I$3=$M$4,'SP Bolted'!C253,IF($I$3=$M$5,'SP Welded'!C253,\"\")))","v":13.5}]
[{"$f":"IF($I$3=$M$3,'SP Plus Bolted'!A254,IF($I$3=$M$4,'SP Bolted'!A254,IF($I$3=$M$5,'SP Welded'!A254,\"\")))","v":"W10X33"},{"$f":"IF($I$3=$M$3,'SP Plus Bolted'!B254,IF($I$3=$M$4,'SP Bolted'!B254,IF($I$3=$M$5,'SP Welded'!B254,\"\")))","v":11},{"$f":"IF($I$3=$M$3,'SP Plus Bolted'!C254,IF($I$3=$M$4,'SP Bolted'!C254,IF($I$3=$M$5,'SP Welded'!C254,\"\")))","v":13.5}]
[{"$f":"IF($I$3=$M$3,'SP Plus Bolted'!A255,IF($I$3=$M$4,'SP Bolted'!A255,IF($I$3=$M$5,'SP Welded'!A255,\"\")))","v":"W10X30"},{"$f":"IF($I$3=$M$3,'SP Plus Bolted'!B255,IF($I$3=$M$4,'SP Bolted'!B255,IF($I$3=$M$5,'SP Welded'!B255,\"\")))","v":11},{"$f":"IF($I$3=$M$3,'SP Plus Bolted'!C255,IF($I$3=$M$4,'SP Bolted'!C255,IF($I$3=$M$5,'SP Welded'!C255,\"\")))","v":14}]
[{"$f":"IF($I$3=$M$3,'SP Plus Bolted'!A256,IF($I$3=$M$4,'SP Bolted'!A256,IF($I$3=$M$5,'SP Welded'!A256,\"\")))","v":"W10X26"},{"$f":"IF($I$3=$M$3,'SP Plus Bolted'!B256,IF($I$3=$M$4,'SP Bolted'!B256,IF($I$3=$M$5,'SP Welded'!B256,\"\")))","v":11},{"$f":"IF($I$3=$M$3,'SP Plus Bolted'!C256,IF($I$3=$M$4,'SP Bolted'!C256,IF($I$3=$M$5,'SP Welded'!C256,\"\")))","v":14}]
[{"$f":"IF($I$3=$M$3,'SP Plus Bolted'!A257,IF($I$3=$M$4,'SP Bolted'!A257,IF($I$3=$M$5,'SP Welded'!A257,\"\")))","v":"W10X22"},{"$f":"IF($I$3=$M$3,'SP Plus Bolted'!B257,IF($I$3=$M$4,'SP Bolted'!B257,IF($I$3=$M$5,'SP Welded'!B257,\"\")))","v":11},{"$f":"IF($I$3=$M$3,'SP Plus Bolted'!C257,IF($I$3=$M$4,'SP Bolted'!C257,IF($I$3=$M$5,'SP Welded'!C257,\"\")))","v":14}]
[{"$f":"IF($I$3=$M$3,'SP Plus Bolted'!A258,IF($I$3=$M$4,'SP Bolted'!A258,IF($I$3=$M$5,'SP Welded'!A258,\"\")))","v":"W10X19"},{"$f":"IF($I$3=$M$3,'SP Plus Bolted'!B258,IF($I$3=$M$4,'SP Bolted'!B258,IF($I$3=$M$5,'SP Welded'!B258,\"\")))","v":11},{"$f":"IF($I$3=$M$3,'SP Plus Bolted'!C258,IF($I$3=$M$4,'SP Bolted'!C258,IF($I$3=$M$5,'SP Welded'!C258,\"\")))","v":14}]
[{"$f":"IF($I$3=$M$3,'SP Plus Bolted'!A259,IF($I$3=$M$4,'SP Bolted'!A259,IF($I$3=$M$5,'SP Welded'!A259,\"\")))","v":"W10X17"},{"$f":"IF($I$3=$M$3,'SP Plus Bolted'!B259,IF($I$3=$M$4,'SP Bolted'!B259,IF($I$3=$M$5,'SP Welded'!B259,\"\")))","v":11},{"$f":"IF($I$3=$M$3,'SP Plus Bolted'!C259,IF($I$3=$M$4,'SP Bolted'!C259,IF($I$3=$M$5,'SP Welded'!C259,\"\")))","v":14}]
[{"$f":"IF($I$3=$M$3,'SP Plus Bolted'!A260,IF($I$3=$M$4,'SP Bolted'!A260,IF($I$3=$M$5,'SP Welded'!A260,\"\")))","v":"W10X15"},{"$f":"IF($I$3=$M$3,'SP Plus Bolted'!B260,IF($I$3=$M$4,'SP Bolted'!B260,IF($I$3=$M$5,'SP Welded'!B260,\"\")))","v":11},{"$f":"IF($I$3=$M$3,'SP Plus Bolted'!C260,IF($I$3=$M$4,'SP Bolted'!C260,IF($I$3=$M$5,'SP Welded'!C260,\"\")))","v":13.5}]
[{"$f":"IF($I$3=$M$3,'SP Plus Bolted'!A261,IF($I$3=$M$4,'SP Bolted'!A261,IF($I$3=$M$5,'SP Welded'!A261,\"\")))","v":"W10X12"},{"$f":"IF($I$3=$M$3,'SP Plus Bolted'!B261,IF($I$3=$M$4,'SP Bolted'!B261,IF($I$3=$M$5,'SP Welded'!B261,\"\")))","v":11},{"$f":"IF($I$3=$M$3,'SP Plus Bolted'!C261,IF($I$3=$M$4,'SP Bolted'!C261,IF($I$3=$M$5,'SP Welded'!C261,\"\")))","v":13.5}]
[{"$f":"IF($I$3=$M$3,'SP Plus Bolted'!A262,IF($I$3=$M$4,'SP Bolted'!A262,IF($I$3=$M$5,'SP Welded'!A262,\"\")))","v":"W8X67"},{"$f":"IF($I$3=$M$3,'SP Plus Bolted'!B262,IF($I$3=$M$4,'SP Bolted'!B262,IF($I$3=$M$5,'SP Welded'!B262,\"\")))","v":11},{"$f":"IF($I$3=$M$3,'SP Plus Bolted'!C262,IF($I$3=$M$4,'SP Bolted'!C262,IF($I$3=$M$5,'SP Welded'!C262,\"\")))","v":12.5}]
[{"$f":"IF($I$3=$M$3,'SP Plus Bolted'!A263,IF($I$3=$M$4,'SP Bolted'!A263,IF($I$3=$M$5,'SP Welded'!A263,\"\")))","v":"W8X58"},{"$f":"IF($I$3=$M$3,'SP Plus Bolted'!B263,IF($I$3=$M$4,'SP Bolted'!B263,IF($I$3=$M$5,'SP Welded'!B263,\"\")))","v":11},{"$f":"IF($I$3=$M$3,'SP Plus Bolted'!C263,IF($I$3=$M$4,'SP Bolted'!C263,IF($I$3=$M$5,'SP Welded'!C263,\"\")))","v":12.5}]
[{"$f":"IF($I$3=$M$3,'SP Plus Bolted'!A264,IF($I$3=$M$4,'SP Bolted'!A264,IF($I$3=$M$5,'SP Welded'!A264,\"\")))","v":"W8X48"},{"$f":"IF($I$3=$M$3,'SP Plus Bolted'!B264,IF($I$3=$M$4,'SP Bolted'!B264,IF($I$3=$M$5,'SP Welded'!B264,\"\")))","v":11},{"$f":"IF($I$3=$M$3,'SP Plus Bolted'!C264,IF($I$3=$M$4,'SP Bolted'!C264,IF($I$3=$M$5,'SP Welded'!C264,\"\")))","v":12}]
[{"$f":"IF($I$3=$M$3,'SP Plus Bolted'!A265,IF($I$3=$M$4,'SP Bolted'!A265,IF($I$3=$M$5,'SP Welded'!A265,\"\")))","v":"W8X40"},{"$f":"IF($I$3=$M$3,'SP Plus Bolted'!B265,IF($I$3=$M$4,'SP Bolted'!B265,IF($I$3=$M$5,'SP Welded'!B265,\"\")))","v":11},{"$f":"IF($I$3=$M$3,'SP Plus Bolted'!C265,IF($I$3=$M$4,'SP Bolted'!C265,IF($I$3=$M$5,'SP Welded'!C265,\"\")))","v":12}]
[{"$f":"IF($I$3=$M$3,'SP Plus Bolted'!A266,IF($I$3=$M$4,'SP Bolted'!A266,IF($I$3=$M$5,'SP Welded'!A266,\"\")))","v":"W8X35"},{"$f":"IF($I$3=$M$3,'SP Plus Bolted'!B266,IF($I$3=$M$4,'SP Bolted'!B266,IF($I$3=$M$5,'SP Welded'!B266,\"\")))","v":11},{"$f":"IF($I$3=$M$3,'SP Plus Bolted'!C266,IF($I$3=$M$4,'SP Bolted'!C266,IF($I$3=$M$5,'SP Welded'!C266,\"\")))","v":12}]
[{"$f":"IF($I$3=$M$3,'SP Plus Bolted'!A267,IF($I$3=$M$4,'SP Bolted'!A267,IF($I$3=$M$5,'SP Welded'!A267,\"\")))","v":"W8X31"},{"$f":"IF($I$3=$M$3,'SP Plus Bolted'!B267,IF($I$3=$M$4,'SP Bolted'!B267,IF($I$3=$M$5,'SP Welded'!B267,\"\")))","v":11},{"$f":"IF($I$3=$M$3,'SP Plus Bolted'!C267,IF($I$3=$M$4,'SP Bolted'!C267,IF($I$3=$M$5,'SP Welded'!C267,\"\")))","v":11.5}]
[{"$f":"IF($I$3=$M$3,'SP Plus Bolted'!A268,IF($I$3=$M$4,'SP Bolted'!A268,IF($I$3=$M$5,'SP Welded'!A268,\"\")))","v":"W8X28"},{"$f":"IF($I$3=$M$3,'SP Plus Bolted'!B268,IF($I$3=$M$4,'SP Bolted'!B268,IF($I$3=$M$5,'SP Welded'!B268,\"\")))","v":11},{"$f":"IF($I$3=$M$3,'SP Plus Bolted'!C268,IF($I$3=$M$4,'SP Bolted'!C268,IF($I$3=$M$5,'SP Welded'!C268,\"\")))","v":11.5}]
[{"$f":"IF($I$3=$M$3,'SP Plus Bolted'!A269,IF($I$3=$M$4,'SP Bolted'!A269,IF($I$3=$M$5,'SP Welded'!A269,\"\")))","v":"W8X24"},{"$f":"IF($I$3=$M$3,'SP Plus Bolted'!B269,IF($I$3=$M$4,'SP Bolted'!B269,IF($I$3=$M$5,'SP Welded'!B269,\"\")))","v":11},{"$f":"IF($I$3=$M$3,'SP Plus Bolted'!C269,IF($I$3=$M$4,'SP Bolted'!C269,IF($I$3=$M$5,'SP Welded'!C269,\"\")))","v":11.5}]
[{"$f":"IF($I$3=$M$3,'SP Plus Bolted'!A270,IF($I$3=$M$4,'SP Bolted'!A270,IF($I$3=$M$5,'SP Welded'!A270,\"\")))","v":"W8X21"},{"$f":"IF($I$3=$M$3,'SP Plus Bolted'!B270,IF($I$3=$M$4,'SP Bolted'!B270,IF($I$3=$M$5,'SP Welded'!B270,\"\")))","v":11},{"$f":"IF($I$3=$M$3,'SP Plus Bolted'!C270,IF($I$3=$M$4,'SP Bolted'!C270,IF($I$3=$M$5,'SP Welded'!C270,\"\")))","v":12}]
[{"$f":"IF($I$3=$M$3,'SP Plus Bolted'!A271,IF($I$3=$M$4,'SP Bolted'!A271,IF($I$3=$M$5,'SP Welded'!A271,\"\")))","v":"W8X18"},{"$f":"IF($I$3=$M$3,'SP Plus Bolted'!B271,IF($I$3=$M$4,'SP Bolted'!B271,IF($I$3=$M$5,'SP Welded'!B271,\"\")))","v":11},{"$f":"IF($I$3=$M$3,'SP Plus Bolted'!C271,IF($I$3=$M$4,'SP Bolted'!C271,IF($I$3=$M$5,'SP Welded'!C271,\"\")))","v":12}]
[{"$f":"IF($I$3=$M$3,'SP Plus Bolted'!A272,IF($I$3=$M$4,'SP Bolted'!A272,IF($I$3=$M$5,'SP Welded'!A272,\"\")))","v":"W8X15"},{"$f":"IF($I$3=$M$3,'SP Plus Bolted'!B272,IF($I$3=$M$4,'SP Bolted'!B272,IF($I$3=$M$5,'SP Welded'!B272,\"\")))","v":11},{"$f":"IF($I$3=$M$3,'SP Plus Bolted'!C272,IF($I$3=$M$4,'SP Bolted'!C272,IF($I$3=$M$5,'SP Welded'!C272,\"\")))","v":12}]
[{"$f":"IF($I$3=$M$3,'SP Plus Bolted'!A273,IF($I$3=$M$4,'SP Bolted'!A273,IF($I$3=$M$5,'SP Welded'!A273,\"\")))","v":"W8X13"},{"$f":"IF($I$3=$M$3,'SP Plus Bolted'!B273,IF($I$3=$M$4,'SP Bolted'!B273,IF($I$3=$M$5,'SP Welded'!B273,\"\")))","v":11},{"$f":"IF($I$3=$M$3,'SP Plus Bolted'!C273,IF($I$3=$M$4,'SP Bolted'!C273,IF($I$3=$M$5,'SP Welded'!C273,\"\")))","v":11.5}]
[{"$f":"IF($I$3=$M$3,'SP Plus Bolted'!A274,IF($I$3=$M$4,'SP Bolted'!A274,IF($I$3=$M$5,'SP Welded'!A274,\"\")))","v":"W8X10"},{"$f":"IF($I$3=$M$3,'SP Plus Bolted'!B274,IF($I$3=$M$4,'SP Bolted'!B274,IF($I$3=$M$5,'SP Welded'!B274,\"\")))","v":11},{"$f":"IF($I$3=$M$3,'SP Plus Bolted'!C274,IF($I$3=$M$4,'SP Bolted'!C274,IF($I$3=$M$5,'SP Welded'!C274,\"\")))","v":12}]
[{"$f":"IF($I$3=$M$3,'SP Plus Bolted'!A275,IF($I$3=$M$4,'SP Bolted'!A275,IF($I$3=$M$5,'SP Welded'!A275,\"\")))","v":"HSS24X12X3/4"},{"$f":"IF($I$3=$M$3,'SP Plus Bolted'!B275,IF($I$3=$M$4,'SP Bolted'!B275,IF($I$3=$M$5,'SP Welded'!B275,\"\")))","v":21},{"$f":"IF($I$3=$M$3,'SP Plus Bolted'!C275,IF($I$3=$M$4,'SP Bolted'!C275,IF($I$3=$M$5,'SP Welded'!C275,\"\")))","v":27.5}]
[{"$f":"IF($I$3=$M$3,'SP Plus Bolted'!A276,IF($I$3=$M$4,'SP Bolted'!A276,IF($I$3=$M$5,'SP Welded'!A276,\"\")))","v":"HSS24X12X5/8"},{"$f":"IF($I$3=$M$3,'SP Plus Bolted'!B276,IF($I$3=$M$4,'SP Bolted'!B276,IF($I$3=$M$5,'SP Welded'!B276,\"\")))","v":21},{"$f":"IF($I$3=$M$3,'SP Plus Bolted'!C276,IF($I$3=$M$4,'SP Bolted'!C276,IF($I$3=$M$5,'SP Welded'!C276,\"\")))","v":27.5}]
[{"$f":"IF($I$3=$M$3,'SP Plus Bolted'!A277,IF($I$3=$M$4,'SP Bolted'!A277,IF($I$3=$M$5,'SP Welded'!A277,\"\")))","v":"HSS24X12X1/2"},{"$f":"IF($I$3=$M$3,'SP Plus Bolted'!B277,IF($I$3=$M$4,'SP Bolted'!B277,IF($I$3=$M$5,'SP Welded'!B277,\"\")))","v":21},{"$f":"IF($I$3=$M$3,'SP Plus Bolted'!C277,IF($I$3=$M$4,'SP Bolted'!C277,IF($I$3=$M$5,'SP Welded'!C277,\"\")))","v":27.5}]
[{"$f":"IF($I$3=$M$3,'SP Plus Bolted'!A278,IF($I$3=$M$4,'SP Bolted'!A278,IF($I$3=$M$5,'SP Welded'!A278,\"\")))","v":"HSS22X22X7/8"},{"$f":"IF($I$3=$M$3,'SP Plus Bolted'!B278,IF($I$3=$M$4,'SP Bolted'!B278,IF($I$3=$M$5,'SP Welded'!B278,\"\")))","v":19},{"$f":"IF($I$3=$M$3,'SP Plus Bolted'!C278,IF($I$3=$M$4,'SP Bolted'!C278,IF($I$3=$M$5,'SP Welded'!C278,\"\")))","v":25.5}]
[{"$f":"IF($I$3=$M$3,'SP Plus Bolted'!A279,IF($I$3=$M$4,'SP Bolted'!A279,IF($I$3=$M$5,'SP Welded'!A279,\"\")))","v":"HSS22X22X3/4"},{"$f":"IF($I$3=$M$3,'SP Plus Bolted'!B279,IF($I$3=$M$4,'SP Bolted'!B279,IF($I$3=$M$5,'SP Welded'!B279,\"\")))","v":19},{"$f":"IF($I$3=$M$3,'SP Plus Bolted'!C279,IF($I$3=$M$4,'SP Bolted'!C279,IF($I$3=$M$5,'SP Welded'!C279,\"\")))","v":25.5}]
[{"$f":"IF($I$3=$M$3,'SP Plus Bolted'!A280,IF($I$3=$M$4,'SP Bolted'!A280,IF($I$3=$M$5,'SP Welded'!A280,\"\")))","v":"HSS20X20X7/8"},{"$f":"IF($I$3=$M$3,'SP Plus Bolted'!B280,IF($I$3=$M$4,'SP Bolted'!B280,IF($I$3=$M$5,'SP Welded'!B280,\"\")))","v":17},{"$f":"IF($I$3=$M$3,'SP Plus Bolted'!C280,IF($I$3=$M$4,'SP Bolted'!C280,IF($I$3=$M$5,'SP Welded'!C280,\"\")))","v":23.5}]
[{"$f":"IF($I$3=$M$3,'SP Plus Bolted'!A281,IF($I$3=$M$4,'SP Bolted'!A281,IF($I$3=$M$5,'SP Welded'!A281,\"\")))","v":"HSS20X20X3/4"},{"$f":"IF($I$3=$M$3,'SP Plus Bolted'!B281,IF($I$3=$M$4,'SP Bolted'!B281,IF($I$3=$M$5,'SP Welded'!B281,\"\")))","v":17},{"$f":"IF($I$3=$M$3,'SP Plus Bolted'!C281,IF($I$3=$M$4,'SP Bolted'!C281,IF($I$3=$M$5,'SP Welded'!C281,\"\")))","v":23.5}]
[{"$f":"IF($I$3=$M$3,'SP Plus Bolted'!A282,IF($I$3=$M$4,'SP Bolted'!A282,IF($I$3=$M$5,'SP Welded'!A282,\"\")))","v":"HSS20X20X5/8"},{"$f":"IF($I$3=$M$3,'SP Plus Bolted'!B282,IF($I$3=$M$4,'SP Bolted'!B282,IF($I$3=$M$5,'SP Welded'!B282,\"\")))","v":17},{"$f":"IF($I$3=$M$3,'SP Plus Bolted'!C282,IF($I$3=$M$4,'SP Bolted'!C282,IF($I$3=$M$5,'SP Welded'!C282,\"\")))","v":23.5}]
[{"$f":"IF($I$3=$M$3,'SP Plus Bolted'!A283,IF($I$3=$M$4,'SP Bolted'!A283,IF($I$3=$M$5,'SP Welded'!A283,\"\")))","v":"HSS20X20X1/2"},{"$f":"IF($I$3=$M$3,'SP Plus Bolted'!B283,IF($I$3=$M$4,'SP Bolted'!B283,IF($I$3=$M$5,'SP Welded'!B283,\"\")))","v":17},{"$f":"IF($I$3=$M$3,'SP Plus Bolted'!C283,IF($I$3=$M$4,'SP Bolted'!C283,IF($I$3=$M$5,'SP Welded'!C283,\"\")))","v":23.5}]
[{"$f":"IF($I$3=$M$3,'SP Plus Bolted'!A284,IF($I$3=$M$4,'SP Bolted'!A284,IF($I$3=$M$5,'SP Welded'!A284,\"\")))","v":"HSS20X12X3/4"},{"$f":"IF($I$3=$M$3,'SP Plus Bolted'!B284,IF($I$3=$M$4,'SP Bolted'!B284,IF($I$3=$M$5,'SP Welded'!B284,\"\")))","v":17},{"$f":"IF($I$3=$M$3,'SP Plus Bolted'!C284,IF($I$3=$M$4,'SP Bolted'!C284,IF($I$3=$M$5,'SP Welded'!C284,\"\")))","v":23.5}]
[{"$f":"IF($I$3=$M$3,'SP Plus Bolted'!A285,IF($I$3=$M$4,'SP Bolted'!A285,IF($I$3=$M$5,'SP Welded'!A285,\"\")))","v":"HSS20X12X5/8"},{"$f":"IF($I$3=$M$3,'SP Plus Bolted'!B285,IF($I$3=$M$4,'SP Bolted'!B285,IF($I$3=$M$5,'SP Welded'!B285,\"\")))","v":17},{"$f":"IF($I$3=$M$3,'SP Plus Bolted'!C285,IF($I$3=$M$4,'SP Bolted'!C285,IF($I$3=$M$5,'SP Welded'!C285,\"\")))","v":23.5}]
[{"$f":"IF($I$3=$M$3,'SP Plus Bolted'!A286,IF($I$3=$M$4,'SP Bolted'!A286,IF($I$3=$M$5,'SP Welded'!A286,\"\")))","v":"HSS20X12X1/2"},{"$f":"IF($I$3=$M$3,'SP Plus Bolted'!B286,IF($I$3=$M$4,'SP Bolted'!B286,IF($I$3=$M$5,'SP Welded'!B286,\"\")))","v":17},{"$f":"IF($I$3=$M$3,'SP Plus Bolted'!C286,IF($I$3=$M$4,'SP Bolted'!C286,IF($I$3=$M$5,'SP Welded'!C286,\"\")))","v":23.5}]
[{"$f":"IF($I$3=$M$3,'SP Plus Bolted'!A287,IF($I$3=$M$4,'SP Bolted'!A287,IF($I$3=$M$5,'SP Welded'!A287,\"\")))","v":"HSS20X12X3/8"},{"$f":"IF($I$3=$M$3,'SP Plus Bolted'!B287,IF($I$3=$M$4,'SP Bolted'!B287,IF($I$3=$M$5,'SP Welded'!B287,\"\")))","v":17},{"$f":"IF($I$3=$M$3,'SP Plus Bolted'!C287,IF($I$3=$M$4,'SP Bolted'!C287,IF($I$3=$M$5,'SP Welded'!C287,\"\")))","v":23.5}]
[{"$f":"IF($I$3=$M$3,'SP Plus Bolted'!A288,IF($I$3=$M$4,'SP Bolted'!A288,IF($I$3=$M$5,'SP Welded'!A288,\"\")))","v":"HSS20X12X5/16"},{"$f":"IF($I$3=$M$3,'SP Plus Bolted'!B288,IF($I$3=$M$4,'SP Bolted'!B288,IF($I$3=$M$5,'SP Welded'!B288,\"\")))","v":17},{"$f":"IF($I$3=$M$3,'SP Plus Bolted'!C288,IF($I$3=$M$4,'SP Bolted'!C288,IF($I$3=$M$5,'SP Welded'!C288,\"\")))","v":23.5}]
[{"$f":"IF($I$3=$M$3,'SP Plus Bolted'!A289,IF($I$3=$M$4,'SP Bolted'!A289,IF($I$3=$M$5,'SP Welded'!A289,\"\")))","v":"HSS20X8X5/8"},{"$f":"IF($I$3=$M$3,'SP Plus Bolted'!B289,IF($I$3=$M$4,'SP Bolted'!B289,IF($I$3=$M$5,'SP Welded'!B289,\"\")))","v":17},{"$f":"IF($I$3=$M$3,'SP Plus Bolted'!C289,IF($I$3=$M$4,'SP Bolted'!C289,IF($I$3=$M$5,'SP Welded'!C289,\"\")))","v":23.5}]
[{"$f":"IF($I$3=$M$3,'SP Plus Bolted'!A290,IF($I$3=$M$4,'SP Bolted'!A290,IF($I$3=$M$5,'SP Welded'!A290,\"\")))","v":"HSS20X8X1/2"},{"$f":"IF($I$3=$M$3,'SP Plus Bolted'!B290,IF($I$3=$M$4,'SP Bolted'!B290,IF($I$3=$M$5,'SP Welded'!B290,\"\")))","v":17},{"$f":"IF($I$3=$M$3,'SP Plus Bolted'!C290,IF($I$3=$M$4,'SP Bolted'!C290,IF($I$3=$M$5,'SP Welded'!C290,\"\")))","v":23.5}]
[{"$f":"IF($I$3=$M$3,'SP Plus Bolted'!A291,IF($I$3=$M$4,'SP Bolted'!A291,IF($I$3=$M$5,'SP Welded'!A291,\"\")))","v":"HSS20X8X3/8"},{"$f":"IF($I$3=$M$3,'SP Plus Bolted'!B291,IF($I$3=$M$4,'SP Bolted'!B291,IF($I$3=$M$5,'SP Welded'!B291,\"\")))","v":17},{"$f":"IF($I$3=$M$3,'SP Plus Bolted'!C291,IF($I$3=$M$4,'SP Bolted'!C291,IF($I$3=$M$5,'SP Welded'!C291,\"\")))","v":23.5}]
[{"$f":"IF($I$3=$M$3,'SP Plus Bolted'!A292,IF($I$3=$M$4,'SP Bolted'!A292,IF($I$3=$M$5,'SP Welded'!A292,\"\")))","v":"HSS20X8X5/16"},{"$f":"IF($I$3=$M$3,'SP Plus Bolted'!B292,IF($I$3=$M$4,'SP Bolted'!B292,IF($I$3=$M$5,'SP Welded'!B292,\"\")))","v":17},{"$f":"IF($I$3=$M$3,'SP Plus Bolted'!C292,IF($I$3=$M$4,'SP Bolted'!C292,IF($I$3=$M$5,'SP Welded'!C292,\"\")))","v":23.5}]
[{"$f":"IF($I$3=$M$3,'SP Plus Bolted'!A293,IF($I$3=$M$4,'SP Bolted'!A293,IF($I$3=$M$5,'SP Welded'!A293,\"\")))","v":"HSS20X4X1/2"},{"$f":"IF($I$3=$M$3,'SP Plus Bolted'!B293,IF($I$3=$M$4,'SP Bolted'!B293,IF($I$3=$M$5,'SP Welded'!B293,\"\")))","v":17},{"$f":"IF($I$3=$M$3,'SP Plus Bolted'!C293,IF($I$3=$M$4,'SP Bolted'!C293,IF($I$3=$M$5,'SP Welded'!C293,\"\")))","v":23.5}]
[{"$f":"IF($I$3=$M$3,'SP Plus Bolted'!A294,IF($I$3=$M$4,'SP Bolted'!A294,IF($I$3=$M$5,'SP Welded'!A294,\"\")))","v":"HSS20X4X3/8"},{"$f":"IF($I$3=$M$3,'SP Plus Bolted'!B294,IF($I$3=$M$4,'SP Bolted'!B294,IF($I$3=$M$5,'SP Welded'!B294,\"\")))","v":17},{"$f":"IF($I$3=$M$3,'SP Plus Bolted'!C294,IF($I$3=$M$4,'SP Bolted'!C294,IF($I$3=$M$5,'SP Welded'!C294,\"\")))","v":23.5}]
[{"$f":"IF($I$3=$M$3,'SP Plus Bolted'!A295,IF($I$3=$M$4,'SP Bolted'!A295,IF($I$3=$M$5,'SP Welded'!A295,\"\")))","v":"HSS20X4X5/16"},{"$f":"IF($I$3=$M$3,'SP Plus Bolted'!B295,IF($I$3=$M$4,'SP Bolted'!B295,IF($I$3=$M$5,'SP Welded'!B295,\"\")))","v":17},{"$f":"IF($I$3=$M$3,'SP Plus Bolted'!C295,IF($I$3=$M$4,'SP Bolted'!C295,IF($I$3=$M$5,'SP Welded'!C295,\"\")))","v":23.5}]
[{"$f":"IF($I$3=$M$3,'SP Plus Bolted'!A296,IF($I$3=$M$4,'SP Bolted'!A296,IF($I$3=$M$5,'SP Welded'!A296,\"\")))","v":"HSS20X4X1/4"},{"$f":"IF($I$3=$M$3,'SP Plus Bolted'!B296,IF($I$3=$M$4,'SP Bolted'!B296,IF($I$3=$M$5,'SP Welded'!B296,\"\")))","v":17},{"$f":"IF($I$3=$M$3,'SP Plus Bolted'!C296,IF($I$3=$M$4,'SP Bolted'!C296,IF($I$3=$M$5,'SP Welded'!C296,\"\")))","v":23.5}]
[{"$f":"IF($I$3=$M$3,'SP Plus Bolted'!A297,IF($I$3=$M$4,'SP Bolted'!A297,IF($I$3=$M$5,'SP Welded'!A297,\"\")))","v":"HSS18X18X7/8"},{"$f":"IF($I$3=$M$3,'SP Plus Bolted'!B297,IF($I$3=$M$4,'SP Bolted'!B297,IF($I$3=$M$5,'SP Welded'!B297,\"\")))","v":16},{"$f":"IF($I$3=$M$3,'SP Plus Bolted'!C297,IF($I$3=$M$4,'SP Bolted'!C297,IF($I$3=$M$5,'SP Welded'!C297,\"\")))","v":21.5}]
[{"$f":"IF($I$3=$M$3,'SP Plus Bolted'!A298,IF($I$3=$M$4,'SP Bolted'!A298,IF($I$3=$M$5,'SP Welded'!A298,\"\")))","v":"HSS18X18X3/4"},{"$f":"IF($I$3=$M$3,'SP Plus Bolted'!B298,IF($I$3=$M$4,'SP Bolted'!B298,IF($I$3=$M$5,'SP Welded'!B298,\"\")))","v":16},{"$f":"IF($I$3=$M$3,'SP Plus Bolted'!C298,IF($I$3=$M$4,'SP Bolted'!C298,IF($I$3=$M$5,'SP Welded'!C298,\"\")))","v":21.5}]
[{"$f":"IF($I$3=$M$3,'SP Plus Bolted'!A299,IF($I$3=$M$4,'SP Bolted'!A299,IF($I$3=$M$5,'SP Welded'!A299,\"\")))","v":"HSS18X18X5/8"},{"$f":"IF($I$3=$M$3,'SP Plus Bolted'!B299,IF($I$3=$M$4,'SP Bolted'!B299,IF($I$3=$M$5,'SP Welded'!B299,\"\")))","v":16},{"$f":"IF($I$3=$M$3,'SP Plus Bolted'!C299,IF($I$3=$M$4,'SP Bolted'!C299,IF($I$3=$M$5,'SP Welded'!C299,\"\")))","v":21.5}]
[{"$f":"IF($I$3=$M$3,'SP Plus Bolted'!A300,IF($I$3=$M$4,'SP Bolted'!A300,IF($I$3=$M$5,'SP Welded'!A300,\"\")))","v":"HSS18X18X1/2"},{"$f":"IF($I$3=$M$3,'SP Plus Bolted'!B300,IF($I$3=$M$4,'SP Bolted'!B300,IF($I$3=$M$5,'SP Welded'!B300,\"\")))","v":16},{"$f":"IF($I$3=$M$3,'SP Plus Bolted'!C300,IF($I$3=$M$4,'SP Bolted'!C300,IF($I$3=$M$5,'SP Welded'!C300,\"\")))","v":21.5}]
[{"$f":"IF($I$3=$M$3,'SP Plus Bolted'!A301,IF($I$3=$M$4,'SP Bolted'!A301,IF($I$3=$M$5,'SP Welded'!A301,\"\")))","v":"HSS18X6X5/8"},{"$f":"IF($I$3=$M$3,'SP Plus Bolted'!B301,IF($I$3=$M$4,'SP Bolted'!B301,IF($I$3=$M$5,'SP Welded'!B301,\"\")))","v":16},{"$f":"IF($I$3=$M$3,'SP Plus Bolted'!C301,IF($I$3=$M$4,'SP Bolted'!C301,IF($I$3=$M$5,'SP Welded'!C301,\"\")))","v":21.5}]
[{"$f":"IF($I$3=$M$3,'SP Plus Bolted'!A302,IF($I$3=$M$4,'SP Bolted'!A302,IF($I$3=$M$5,'SP Welded'!A302,\"\")))","v":"HSS18X6X1/2"},{"$f":"IF($I$3=$M$3,'SP Plus Bolted'!B302,IF($I$3=$M$4,'SP Bolted'!B302,IF($I$3=$M$5,'SP Welded'!B302,\"\")))","v":16},{"$f":"IF($I$3=$M$3,'SP Plus Bolted'!C302,IF($I$3=$M$4,'SP Bolted'!C302,IF($I$3=$M$5,'SP Welded'!C302,\"\")))","v":21.5}]
[{"$f":"IF($I$3=$M$3,'SP Plus Bolted'!A303,IF($I$3=$M$4,'SP Bolted'!A303,IF($I$3=$M$5,'SP Welded'!A303,\"\")))","v":"HSS18X6X3/8"},{"$f":"IF($I$3=$M$3,'SP Plus Bolted'!B303,IF($I$3=$M$4,'SP Bolted'!B303,IF($I$3=$M$5,'SP Welded'!B303,\"\")))","v":16},{"$f":"IF($I$3=$M$3,'SP Plus Bolted'!C303,IF($I$3=$M$4,'SP Bolted'!C303,IF($I$3=$M$5,'SP Welded'!C303,\"\")))","v":21.5}]
[{"$f":"IF($I$3=$M$3,'SP Plus Bolted'!A304,IF($I$3=$M$4,'SP Bolted'!A304,IF($I$3=$M$5,'SP Welded'!A304,\"\")))","v":"HSS18X6X5/16"},{"$f":"IF($I$3=$M$3,'SP Plus Bolted'!B304,IF($I$3=$M$4,'SP Bolted'!B304,IF($I$3=$M$5,'SP Welded'!B304,\"\")))","v":16},{"$f":"IF($I$3=$M$3,'SP Plus Bolted'!C304,IF($I$3=$M$4,'SP Bolted'!C304,IF($I$3=$M$5,'SP Welded'!C304,\"\")))","v":21.5}]
[{"$f":"IF($I$3=$M$3,'SP Plus Bolted'!A305,IF($I$3=$M$4,'SP Bolted'!A305,IF($I$3=$M$5,'SP Welded'!A305,\"\")))","v":"HSS18X6X1/4"},{"$f":"IF($I$3=$M$3,'SP Plus Bolted'!B305,IF($I$3=$M$4,'SP Bolted'!B305,IF($I$3=$M$5,'SP Welded'!B305,\"\")))","v":16},{"$f":"IF($I$3=$M$3,'SP Plus Bolted'!C305,IF($I$3=$M$4,'SP Bolted'!C305,IF($I$3=$M$5,'SP Welded'!C305,\"\")))","v":21.5}]
[{"$f":"IF($I$3=$M$3,'SP Plus Bolted'!A306,IF($I$3=$M$4,'SP Bolted'!A306,IF($I$3=$M$5,'SP Welded'!A306,\"\")))","v":"HSS16X16X7/8"},{"$f":"IF($I$3=$M$3,'SP Plus Bolted'!B306,IF($I$3=$M$4,'SP Bolted'!B306,IF($I$3=$M$5,'SP Welded'!B306,\"\")))","v":14},{"$f":"IF($I$3=$M$3,'SP Plus Bolted'!C306,IF($I$3=$M$4,'SP Bolted'!C306,IF($I$3=$M$5,'SP Welded'!C306,\"\")))","v":19.5}]
[{"$f":"IF($I$3=$M$3,'SP Plus Bolted'!A307,IF($I$3=$M$4,'SP Bolted'!A307,IF($I$3=$M$5,'SP Welded'!A307,\"\")))","v":"HSS16X16X3/4"},{"$f":"IF($I$3=$M$3,'SP Plus Bolted'!B307,IF($I$3=$M$4,'SP Bolted'!B307,IF($I$3=$M$5,'SP Welded'!B307,\"\")))","v":14},{"$f":"IF($I$3=$M$3,'SP Plus Bolted'!C307,IF($I$3=$M$4,'SP Bolted'!C307,IF($I$3=$M$5,'SP Welded'!C307,\"\")))","v":19.5}]
[{"$f":"IF($I$3=$M$3,'SP Plus Bolted'!A308,IF($I$3=$M$4,'SP Bolted'!A308,IF($I$3=$M$5,'SP Welded'!A308,\"\")))","v":"HSS16X16X5/8"},{"$f":"IF($I$3=$M$3,'SP Plus Bolted'!B308,IF($I$3=$M$4,'SP Bolted'!B308,IF($I$3=$M$5,'SP Welded'!B308,\"\")))","v":14},{"$f":"IF($I$3=$M$3,'SP Plus Bolted'!C308,IF($I$3=$M$4,'SP Bolted'!C308,IF($I$3=$M$5,'SP Welded'!C308,\"\")))","v":19.5}]
[{"$f":"IF($I$3=$M$3,'SP Plus Bolted'!A309,IF($I$3=$M$4,'SP Bolted'!A309,IF($I$3=$M$5,'SP Welded'!A309,\"\")))","v":"HSS16X16X1/2"},{"$f":"IF($I$3=$M$3,'SP Plus Bolted'!B309,IF($I$3=$M$4,'SP Bolted'!B309,IF($I$3=$M$5,'SP Welded'!B309,\"\")))","v":14},{"$f":"IF($I$3=$M$3,'SP Plus Bolted'!C309,IF($I$3=$M$4,'SP Bolted'!C309,IF($I$3=$M$5,'SP Welded'!C309,\"\")))","v":19.5}]
[{"$f":"IF($I$3=$M$3,'SP Plus Bolted'!A310,IF($I$3=$M$4,'SP Bolted'!A310,IF($I$3=$M$5,'SP Welded'!A310,\"\")))","v":"HSS16X16X3/8"},{"$f":"IF($I$3=$M$3,'SP Plus Bolted'!B310,IF($I$3=$M$4,'SP Bolted'!B310,IF($I$3=$M$5,'SP Welded'!B310,\"\")))","v":14},{"$f":"IF($I$3=$M$3,'SP Plus Bolted'!C310,IF($I$3=$M$4,'SP Bolted'!C310,IF($I$3=$M$5,'SP Welded'!C310,\"\")))","v":19.5}]
[{"$f":"IF($I$3=$M$3,'SP Plus Bolted'!A311,IF($I$3=$M$4,'SP Bolted'!A311,IF($I$3=$M$5,'SP Welded'!A311,\"\")))","v":"HSS16X16X5/16"},{"$f":"IF($I$3=$M$3,'SP Plus Bolted'!B311,IF($I$3=$M$4,'SP Bolted'!B311,IF($I$3=$M$5,'SP Welded'!B311,\"\")))","v":14},{"$f":"IF($I$3=$M$3,'SP Plus Bolted'!C311,IF($I$3=$M$4,'SP Bolted'!C311,IF($I$3=$M$5,'SP Welded'!C311,\"\")))","v":19.5}]
[{"$f":"IF($I$3=$M$3,'SP Plus Bolted'!A312,IF($I$3=$M$4,'SP Bolted'!A312,IF($I$3=$M$5,'SP Welded'!A312,\"\")))","v":"HSS16X12X3/4"},{"$f":"IF($I$3=$M$3,'SP Plus Bolted'!B312,IF($I$3=$M$4,'SP Bolted'!B312,IF($I$3=$M$5,'SP Welded'!B312,\"\")))","v":14},{"$f":"IF($I$3=$M$3,'SP Plus Bolted'!C312,IF($I$3=$M$4,'SP Bolted'!C312,IF($I$3=$M$5,'SP Welded'!C312,\"\")))","v":19.5}]
[{"$f":"IF($I$3=$M$3,'SP Plus Bolted'!A313,IF($I$3=$M$4,'SP Bolted'!A313,IF($I$3=$M$5,'SP Welded'!A313,\"\")))","v":"HSS16X12X5/8"},{"$f":"IF($I$3=$M$3,'SP Plus Bolted'!B313,IF($I$3=$M$4,'SP Bolted'!B313,IF($I$3=$M$5,'SP Welded'!B313,\"\")))","v":14},{"$f":"IF($I$3=$M$3,'SP Plus Bolted'!C313,IF($I$3=$M$4,'SP Bolted'!C313,IF($I$3=$M$5,'SP Welded'!C313,\"\")))","v":19.5}]
[{"$f":"IF($I$3=$M$3,'SP Plus Bolted'!A314,IF($I$3=$M$4,'SP Bolted'!A314,IF($I$3=$M$5,'SP Welded'!A314,\"\")))","v":"HSS16X12X1/2"},{"$f":"IF($I$3=$M$3,'SP Plus Bolted'!B314,IF($I$3=$M$4,'SP Bolted'!B314,IF($I$3=$M$5,'SP Welded'!B314,\"\")))","v":14},{"$f":"IF($I$3=$M$3,'SP Plus Bolted'!C314,IF($I$3=$M$4,'SP Bolted'!C314,IF($I$3=$M$5,'SP Welded'!C314,\"\")))","v":19.5}]
[{"$f":"IF($I$3=$M$3,'SP Plus Bolted'!A315,IF($I$3=$M$4,'SP Bolted'!A315,IF($I$3=$M$5,'SP Welded'!A315,\"\")))","v":"HSS16X12X3/8"},{"$f":"IF($I$3=$M$3,'SP Plus Bolted'!B315,IF($I$3=$M$4,'SP Bolted'!B315,IF($I$3=$M$5,'SP Welded'!B315,\"\")))","v":14},{"$f":"IF($I$3=$M$3,'SP Plus Bolted'!C315,IF($I$3=$M$4,'SP Bolted'!C315,IF($I$3=$M$5,'SP Welded'!C315,\"\")))","v":19.5}]
[{"$f":"IF($I$3=$M$3,'SP Plus Bolted'!A316,IF($I$3=$M$4,'SP Bolted'!A316,IF($I$3=$M$5,'SP Welded'!A316,\"\")))","v":"HSS16X12X5/16"},{"$f":"IF($I$3=$M$3,'SP Plus Bolted'!B316,IF($I$3=$M$4,'SP Bolted'!B316,IF($I$3=$M$5,'SP Welded'!B316,\"\")))","v":14},{"$f":"IF($I$3=$M$3,'SP Plus Bolted'!C316,IF($I$3=$M$4,'SP Bolted'!C316,IF($I$3=$M$5,'SP Welded'!C316,\"\")))","v":19.5}]
[{"$f":"IF($I$3=$M$3,'SP Plus Bolted'!A317,IF($I$3=$M$4,'SP Bolted'!A317,IF($I$3=$M$5,'SP Welded'!A317,\"\")))","v":"HSS16X8X5/8"},{"$f":"IF($I$3=$M$3,'SP Plus Bolted'!B317,IF($I$3=$M$4,'SP Bolted'!B317,IF($I$3=$M$5,'SP Welded'!B317,\"\")))","v":14},{"$f":"IF($I$3=$M$3,'SP Plus Bolted'!C317,IF($I$3=$M$4,'SP Bolted'!C317,IF($I$3=$M$5,'SP Welded'!C317,\"\")))","v":19.5}]
[{"$f":"IF($I$3=$M$3,'SP Plus Bolted'!A318,IF($I$3=$M$4,'SP Bolted'!A318,IF($I$3=$M$5,'SP Welded'!A318,\"\")))","v":"HSS16X8X1/2"},{"$f":"IF($I$3=$M$3,'SP Plus Bolted'!B318,IF($I$3=$M$4,'SP Bolted'!B318,IF($I$3=$M$5,'SP Welded'!B318,\"\")))","v":14},{"$f":"IF($I$3=$M$3,'SP Plus Bolted'!C318,IF($I$3=$M$4,'SP Bolted'!C318,IF($I$3=$M$5,'SP Welded'!C318,\"\")))","v":19.5}]
[{"$f":"IF($I$3=$M$3,'SP Plus Bolted'!A319,IF($I$3=$M$4,'SP Bolted'!A319,IF($I$3=$M$5,'SP Welded'!A319,\"\")))","v":"HSS16X8X3/8"},{"$f":"IF($I$3=$M$3,'SP Plus Bolted'!B319,IF($I$3=$M$4,'SP Bolted'!B319,IF($I$3=$M$5,'SP Welded'!B319,\"\")))","v":14},{"$f":"IF($I$3=$M$3,'SP Plus Bolted'!C319,IF($I$3=$M$4,'SP Bolted'!C319,IF($I$3=$M$5,'SP Welded'!C319,\"\")))","v":19.5}]
[{"$f":"IF($I$3=$M$3,'SP Plus Bolted'!A320,IF($I$3=$M$4,'SP Bolted'!A320,IF($I$3=$M$5,'SP Welded'!A320,\"\")))","v":"HSS16X8X5/16"},{"$f":"IF($I$3=$M$3,'SP Plus Bolted'!B320,IF($I$3=$M$4,'SP Bolted'!B320,IF($I$3=$M$5,'SP Welded'!B320,\"\")))","v":14},{"$f":"IF($I$3=$M$3,'SP Plus Bolted'!C320,IF($I$3=$M$4,'SP Bolted'!C320,IF($I$3=$M$5,'SP Welded'!C320,\"\")))","v":19.5}]
[{"$f":"IF($I$3=$M$3,'SP Plus Bolted'!A321,IF($I$3=$M$4,'SP Bolted'!A321,IF($I$3=$M$5,'SP Welded'!A321,\"\")))","v":"HSS16X8X1/4"},{"$f":"IF($I$3=$M$3,'SP Plus Bolted'!B321,IF($I$3=$M$4,'SP Bolted'!B321,IF($I$3=$M$5,'SP Welded'!B321,\"\")))","v":14},{"$f":"IF($I$3=$M$3,'SP Plus Bolted'!C321,IF($I$3=$M$4,'SP Bolted'!C321,IF($I$3=$M$5,'SP Welded'!C321,\"\")))","v":19.5}]
[{"$f":"IF($I$3=$M$3,'SP Plus Bolted'!A322,IF($I$3=$M$4,'SP Bolted'!A322,IF($I$3=$M$5,'SP Welded'!A322,\"\")))","v":"HSS16X4X5/8"},{"$f":"IF($I$3=$M$3,'SP Plus Bolted'!B322,IF($I$3=$M$4,'SP Bolted'!B322,IF($I$3=$M$5,'SP Welded'!B322,\"\")))","v":14},{"$f":"IF($I$3=$M$3,'SP Plus Bolted'!C322,IF($I$3=$M$4,'SP Bolted'!C322,IF($I$3=$M$5,'SP Welded'!C322,\"\")))","v":19.5}]
[{"$f":"IF($I$3=$M$3,'SP Plus Bolted'!A323,IF($I$3=$M$4,'SP Bolted'!A323,IF($I$3=$M$5,'SP Welded'!A323,\"\")))","v":"HSS16X4X1/2"},{"$f":"IF($I$3=$M$3,'SP Plus Bolted'!B323,IF($I$3=$M$4,'SP Bolted'!B323,IF($I$3=$M$5,'SP Welded'!B323,\"\")))","v":14},{"$f":"IF($I$3=$M$3,'SP Plus Bolted'!C323,IF($I$3=$M$4,'SP Bolted'!C323,IF($I$3=$M$5,'SP Welded'!C323,\"\")))","v":19.5}]
[{"$f":"IF($I$3=$M$3,'SP Plus Bolted'!A324,IF($I$3=$M$4,'SP Bolted'!A324,IF($I$3=$M$5,'SP Welded'!A324,\"\")))","v":"HSS16X4X3/8"},{"$f":"IF($I$3=$M$3,'SP Plus Bolted'!B324,IF($I$3=$M$4,'SP Bolted'!B324,IF($I$3=$M$5,'SP Welded'!B324,\"\")))","v":14},{"$f":"IF($I$3=$M$3,'SP Plus Bolted'!C324,IF($I$3=$M$4,'SP Bolted'!C324,IF($I$3=$M$5,'SP Welded'!C324,\"\")))","v":19.5}]
[{"$f":"IF($I$3=$M$3,'SP Plus Bolted'!A325,IF($I$3=$M$4,'SP Bolted'!A325,IF($I$3=$M$5,'SP Welded'!A325,\"\")))","v":"HSS16X4X5/16"},{"$f":"IF($I$3=$M$3,'SP Plus Bolted'!B325,IF($I$3=$M$4,'SP Bolted'!B325,IF($I$3=$M$5,'SP Welded'!B325,\"\")))","v":14},{"$f":"IF($I$3=$M$3,'SP Plus Bolted'!C325,IF($I$3=$M$4,'SP Bolted'!C325,IF($I$3=$M$5,'SP Welded'!C325,\"\")))","v":19.5}]
[{"$f":"IF($I$3=$M$3,'SP Plus Bolted'!A326,IF($I$3=$M$4,'SP Bolted'!A326,IF($I$3=$M$5,'SP Welded'!A326,\"\")))","v":"HSS16X4X1/4"},{"$f":"IF($I$3=$M$3,'SP Plus Bolted'!B326,IF($I$3=$M$4,'SP Bolted'!B326,IF($I$3=$M$5,'SP Welded'!B326,\"\")))","v":14},{"$f":"IF($I$3=$M$3,'SP Plus Bolted'!C326,IF($I$3=$M$4,'SP Bolted'!C326,IF($I$3=$M$5,'SP Welded'!C326,\"\")))","v":19.5}]
[{"$f":"IF($I$3=$M$3,'SP Plus Bolted'!A327,IF($I$3=$M$4,'SP Bolted'!A327,IF($I$3=$M$5,'SP Welded'!A327,\"\")))","v":"HSS16X4X3/16"},{"$f":"IF($I$3=$M$3,'SP Plus Bolted'!B327,IF($I$3=$M$4,'SP Bolted'!B327,IF($I$3=$M$5,'SP Welded'!B327,\"\")))","v":14},{"$f":"IF($I$3=$M$3,'SP Plus Bolted'!C327,IF($I$3=$M$4,'SP Bolted'!C327,IF($I$3=$M$5,'SP Welded'!C327,\"\")))","v":19.5}]
[{"$f":"IF($I$3=$M$3,'SP Plus Bolted'!A328,IF($I$3=$M$4,'SP Bolted'!A328,IF($I$3=$M$5,'SP Welded'!A328,\"\")))","v":"HSS14X14X7/8"},{"$f":"IF($I$3=$M$3,'SP Plus Bolted'!B328,IF($I$3=$M$4,'SP Bolted'!B328,IF($I$3=$M$5,'SP Welded'!B328,\"\")))","v":12},{"$f":"IF($I$3=$M$3,'SP Plus Bolted'!C328,IF($I$3=$M$4,'SP Bolted'!C328,IF($I$3=$M$5,'SP Welded'!C328,\"\")))","v":17.5}]
[{"$f":"IF($I$3=$M$3,'SP Plus Bolted'!A329,IF($I$3=$M$4,'SP Bolted'!A329,IF($I$3=$M$5,'SP Welded'!A329,\"\")))","v":"HSS14X14X3/4"},{"$f":"IF($I$3=$M$3,'SP Plus Bolted'!B329,IF($I$3=$M$4,'SP Bolted'!B329,IF($I$3=$M$5,'SP Welded'!B329,\"\")))","v":12},{"$f":"IF($I$3=$M$3,'SP Plus Bolted'!C329,IF($I$3=$M$4,'SP Bolted'!C329,IF($I$3=$M$5,'SP Welded'!C329,\"\")))","v":17.5}]
[{"$f":"IF($I$3=$M$3,'SP Plus Bolted'!A330,IF($I$3=$M$4,'SP Bolted'!A330,IF($I$3=$M$5,'SP Welded'!A330,\"\")))","v":"HSS14X14X5/8"},{"$f":"IF($I$3=$M$3,'SP Plus Bolted'!B330,IF($I$3=$M$4,'SP Bolted'!B330,IF($I$3=$M$5,'SP Welded'!B330,\"\")))","v":12},{"$f":"IF($I$3=$M$3,'SP Plus Bolted'!C330,IF($I$3=$M$4,'SP Bolted'!C330,IF($I$3=$M$5,'SP Welded'!C330,\"\")))","v":17.5}]
[{"$f":"IF($I$3=$M$3,'SP Plus Bolted'!A331,IF($I$3=$M$4,'SP Bolted'!A331,IF($I$3=$M$5,'SP Welded'!A331,\"\")))","v":"HSS14X14X1/2"},{"$f":"IF($I$3=$M$3,'SP Plus Bolted'!B331,IF($I$3=$M$4,'SP Bolted'!B331,IF($I$3=$M$5,'SP Welded'!B331,\"\")))","v":12},{"$f":"IF($I$3=$M$3,'SP Plus Bolted'!C331,IF($I$3=$M$4,'SP Bolted'!C331,IF($I$3=$M$5,'SP Welded'!C331,\"\")))","v":17.5}]
[{"$f":"IF($I$3=$M$3,'SP Plus Bolted'!A332,IF($I$3=$M$4,'SP Bolted'!A332,IF($I$3=$M$5,'SP Welded'!A332,\"\")))","v":"HSS14X14X3/8"},{"$f":"IF($I$3=$M$3,'SP Plus Bolted'!B332,IF($I$3=$M$4,'SP Bolted'!B332,IF($I$3=$M$5,'SP Welded'!B332,\"\")))","v":12},{"$f":"IF($I$3=$M$3,'SP Plus Bolted'!C332,IF($I$3=$M$4,'SP Bolted'!C332,IF($I$3=$M$5,'SP Welded'!C332,\"\")))","v":17.5}]
[{"$f":"IF($I$3=$M$3,'SP Plus Bolted'!A333,IF($I$3=$M$4,'SP Bolted'!A333,IF($I$3=$M$5,'SP Welded'!A333,\"\")))","v":"HSS14X14X5/16"},{"$f":"IF($I$3=$M$3,'SP Plus Bolted'!B333,IF($I$3=$M$4,'SP Bolted'!B333,IF($I$3=$M$5,'SP Welded'!B333,\"\")))","v":12},{"$f":"IF($I$3=$M$3,'SP Plus Bolted'!C333,IF($I$3=$M$4,'SP Bolted'!C333,IF($I$3=$M$5,'SP Welded'!C333,\"\")))","v":17.5}]
[{"$f":"IF($I$3=$M$3,'SP Plus Bolted'!A334,IF($I$3=$M$4,'SP Bolted'!A334,IF($I$3=$M$5,'SP Welded'!A334,\"\")))","v":"HSS14X10X5/8"},{"$f":"IF($I$3=$M$3,'SP Plus Bolted'!B334,IF($I$3=$M$4,'SP Bolted'!B334,IF($I$3=$M$5,'SP Welded'!B334,\"\")))","v":12},{"$f":"IF($I$3=$M$3,'SP Plus Bolted'!C334,IF($I$3=$M$4,'SP Bolted'!C334,IF($I$3=$M$5,'SP Welded'!C334,\"\")))","v":17.5}]
[{"$f":"IF($I$3=$M$3,'SP Plus Bolted'!A335,IF($I$3=$M$4,'SP Bolted'!A335,IF($I$3=$M$5,'SP Welded'!A335,\"\")))","v":"HSS14X10X1/2"},{"$f":"IF($I$3=$M$3,'SP Plus Bolted'!B335,IF($I$3=$M$4,'SP Bolted'!B335,IF($I$3=$M$5,'SP Welded'!B335,\"\")))","v":12},{"$f":"IF($I$3=$M$3,'SP Plus Bolted'!C335,IF($I$3=$M$4,'SP Bolted'!C335,IF($I$3=$M$5,'SP Welded'!C335,\"\")))","v":17.5}]
[{"$f":"IF($I$3=$M$3,'SP Plus Bolted'!A336,IF($I$3=$M$4,'SP Bolted'!A336,IF($I$3=$M$5,'SP Welded'!A336,\"\")))","v":"HSS14X10X3/8"},{"$f":"IF($I$3=$M$3,'SP Plus Bolted'!B336,IF($I$3=$M$4,'SP Bolted'!B336,IF($I$3=$M$5,'SP Welded'!B336,\"\")))","v":12},{"$f":"IF($I$3=$M$3,'SP Plus Bolted'!C336,IF($I$3=$M$4,'SP Bolted'!C336,IF($I$3=$M$5,'SP Welded'!C336,\"\")))","v":17.5}]
[{"$f":"IF($I$3=$M$3,'SP Plus Bolted'!A337,IF($I$3=$M$4,'SP Bolted'!A337,IF($I$3=$M$5,'SP Welded'!A337,\"\")))","v":"HSS14X10X5/16"},{"$f":"IF($I$3=$M$3,'SP Plus Bolted'!B337,IF($I$3=$M$4,'SP Bolted'!B337,IF($I$3=$M$5,'SP Welded'!B337,\"\")))","v":12},{"$f":"IF($I$3=$M$3,'SP Plus Bolted'!C337,IF($I$3=$M$4,'SP Bolted'!C337,IF($I$3=$M$5,'SP Welded'!C337,\"\")))","v":17.5}]
[{"$f":"IF($I$3=$M$3,'SP Plus Bolted'!A338,IF($I$3=$M$4,'SP Bolted'!A338,IF($I$3=$M$5,'SP Welded'!A338,\"\")))","v":"HSS14X10X1/4"},{"$f":"IF($I$3=$M$3,'SP Plus Bolted'!B338,IF($I$3=$M$4,'SP Bolted'!B338,IF($I$3=$M$5,'SP Welded'!B338,\"\")))","v":12},{"$f":"IF($I$3=$M$3,'SP Plus Bolted'!C338,IF($I$3=$M$4,'SP Bolted'!C338,IF($I$3=$M$5,'SP Welded'!C338,\"\")))","v":17.5}]
[{"$f":"IF($I$3=$M$3,'SP Plus Bolted'!A339,IF($I$3=$M$4,'SP Bolted'!A339,IF($I$3=$M$5,'SP Welded'!A339,\"\")))","v":"HSS14X6X5/8"},{"$f":"IF($I$3=$M$3,'SP Plus Bolted'!B339,IF($I$3=$M$4,'SP Bolted'!B339,IF($I$3=$M$5,'SP Welded'!B339,\"\")))","v":12},{"$f":"IF($I$3=$M$3,'SP Plus Bolted'!C339,IF($I$3=$M$4,'SP Bolted'!C339,IF($I$3=$M$5,'SP Welded'!C339,\"\")))","v":17.5}]
[{"$f":"IF($I$3=$M$3,'SP Plus Bolted'!A340,IF($I$3=$M$4,'SP Bolted'!A340,IF($I$3=$M$5,'SP Welded'!A340,\"\")))","v":"HSS14X6X1/2"},{"$f":"IF($I$3=$M$3,'SP Plus Bolted'!B340,IF($I$3=$M$4,'SP Bolted'!B340,IF($I$3=$M$5,'SP Welded'!B340,\"\")))","v":12},{"$f":"IF($I$3=$M$3,'SP Plus Bolted'!C340,IF($I$3=$M$4,'SP Bolted'!C340,IF($I$3=$M$5,'SP Welded'!C340,\"\")))","v":17.5}]
[{"$f":"IF($I$3=$M$3,'SP Plus Bolted'!A341,IF($I$3=$M$4,'SP Bolted'!A341,IF($I$3=$M$5,'SP Welded'!A341,\"\")))","v":"HSS14X6X3/8"},{"$f":"IF($I$3=$M$3,'SP Plus Bolted'!B341,IF($I$3=$M$4,'SP Bolted'!B341,IF($I$3=$M$5,'SP Welded'!B341,\"\")))","v":12},{"$f":"IF($I$3=$M$3,'SP Plus Bolted'!C341,IF($I$3=$M$4,'SP Bolted'!C341,IF($I$3=$M$5,'SP Welded'!C341,\"\")))","v":17.5}]
[{"$f":"IF($I$3=$M$3,'SP Plus Bolted'!A342,IF($I$3=$M$4,'SP Bolted'!A342,IF($I$3=$M$5,'SP Welded'!A342,\"\")))","v":"HSS14X6X5/16"},{"$f":"IF($I$3=$M$3,'SP Plus Bolted'!B342,IF($I$3=$M$4,'SP Bolted'!B342,IF($I$3=$M$5,'SP Welded'!B342,\"\")))","v":12},{"$f":"IF($I$3=$M$3,'SP Plus Bolted'!C342,IF($I$3=$M$4,'SP Bolted'!C342,IF($I$3=$M$5,'SP Welded'!C342,\"\")))","v":17.5}]
[{"$f":"IF($I$3=$M$3,'SP Plus Bolted'!A343,IF($I$3=$M$4,'SP Bolted'!A343,IF($I$3=$M$5,'SP Welded'!A343,\"\")))","v":"HSS14X6X1/4"},{"$f":"IF($I$3=$M$3,'SP Plus Bolted'!B343,IF($I$3=$M$4,'SP Bolted'!B343,IF($I$3=$M$5,'SP Welded'!B343,\"\")))","v":12},{"$f":"IF($I$3=$M$3,'SP Plus Bolted'!C343,IF($I$3=$M$4,'SP Bolted'!C343,IF($I$3=$M$5,'SP Welded'!C343,\"\")))","v":17.5}]
[{"$f":"IF($I$3=$M$3,'SP Plus Bolted'!A344,IF($I$3=$M$4,'SP Bolted'!A344,IF($I$3=$M$5,'SP Welded'!A344,\"\")))","v":"HSS14X6X3/16"},{"$f":"IF($I$3=$M$3,'SP Plus Bolted'!B344,IF($I$3=$M$4,'SP Bolted'!B344,IF($I$3=$M$5,'SP Welded'!B344,\"\")))","v":12},{"$f":"IF($I$3=$M$3,'SP Plus Bolted'!C344,IF($I$3=$M$4,'SP Bolted'!C344,IF($I$3=$M$5,'SP Welded'!C344,\"\")))","v":17.5}]
[{"$f":"IF($I$3=$M$3,'SP Plus Bolted'!A345,IF($I$3=$M$4,'SP Bolted'!A345,IF($I$3=$M$5,'SP Welded'!A345,\"\")))","v":"HSS14X4X5/8"},{"$f":"IF($I$3=$M$3,'SP Plus Bolted'!B345,IF($I$3=$M$4,'SP Bolted'!B345,IF($I$3=$M$5,'SP Welded'!B345,\"\")))","v":12},{"$f":"IF($I$3=$M$3,'SP Plus Bolted'!C345,IF($I$3=$M$4,'SP Bolted'!C345,IF($I$3=$M$5,'SP Welded'!C345,\"\")))","v":17.5}]
[{"$f":"IF($I$3=$M$3,'SP Plus Bolted'!A346,IF($I$3=$M$4,'SP Bolted'!A346,IF($I$3=$M$5,'SP Welded'!A346,\"\")))","v":"HSS14X4X1/2"},{"$f":"IF($I$3=$M$3,'SP Plus Bolted'!B346,IF($I$3=$M$4,'SP Bolted'!B346,IF($I$3=$M$5,'SP Welded'!B346,\"\")))","v":12},{"$f":"IF($I$3=$M$3,'SP Plus Bolted'!C346,IF($I$3=$M$4,'SP Bolted'!C346,IF($I$3=$M$5,'SP Welded'!C346,\"\")))","v":17.5}]
[{"$f":"IF($I$3=$M$3,'SP Plus Bolted'!A347,IF($I$3=$M$4,'SP Bolted'!A347,IF($I$3=$M$5,'SP Welded'!A347,\"\")))","v":"HSS14X4X3/8"},{"$f":"IF($I$3=$M$3,'SP Plus Bolted'!B347,IF($I$3=$M$4,'SP Bolted'!B347,IF($I$3=$M$5,'SP Welded'!B347,\"\")))","v":12},{"$f":"IF($I$3=$M$3,'SP Plus Bolted'!C347,IF($I$3=$M$4,'SP Bolted'!C347,IF($I$3=$M$5,'SP Welded'!C347,\"\")))","v":17.5}]
[{"$f":"IF($I$3=$M$3,'SP Plus Bolted'!A348,IF($I$3=$M$4,'SP Bolted'!A348,IF($I$3=$M$5,'SP Welded'!A348,\"\")))","v":"HSS14X4X5/16"},{"$f":"IF($I$3=$M$3,'SP Plus Bolted'!B348,IF($I$3=$M$4,'SP Bolted'!B348,IF($I$3=$M$5,'SP Welded'!B348,\"\")))","v":12},{"$f":"IF($I$3=$M$3,'SP Plus Bolted'!C348,IF($I$3=$M$4,'SP Bolted'!C348,IF($I$3=$M$5,'SP Welded'!C348,\"\")))","v":17.5}]
[{"$f":"IF($I$3=$M$3,'SP Plus Bolted'!A349,IF($I$3=$M$4,'SP Bolted'!A349,IF($I$3=$M$5,'SP Welded'!A349,\"\")))","v":"HSS14X4X1/4"},{"$f":"IF($I$3=$M$3,'SP Plus Bolted'!B349,IF($I$3=$M$4,'SP Bolted'!B349,IF($I$3=$M$5,'SP Welded'!B349,\"\")))","v":12},{"$f":"IF($I$3=$M$3,'SP Plus Bolted'!C349,IF($I$3=$M$4,'SP Bolted'!C349,IF($I$3=$M$5,'SP Welded'!C349,\"\")))","v":17.5}]
[{"$f":"IF($I$3=$M$3,'SP Plus Bolted'!A350,IF($I$3=$M$4,'SP Bolted'!A350,IF($I$3=$M$5,'SP Welded'!A350,\"\")))","v":"HSS14X4X3/16"},{"$f":"IF($I$3=$M$3,'SP Plus Bolted'!B350,IF($I$3=$M$4,'SP Bolted'!B350,IF($I$3=$M$5,'SP Welded'!B350,\"\")))","v":12},{"$f":"IF($I$3=$M$3,'SP Plus Bolted'!C350,IF($I$3=$M$4,'SP Bolted'!C350,IF($I$3=$M$5,'SP Welded'!C350,\"\")))","v":17.5}]
[{"$f":"IF($I$3=$M$3,'SP Plus Bolted'!A351,IF($I$3=$M$4,'SP Bolted'!A351,IF($I$3=$M$5,'SP Welded'!A351,\"\")))","v":"HSS12X12X3/4"},{"$f":"IF($I$3=$M$3,'SP Plus Bolted'!B351,IF($I$3=$M$4,'SP Bolted'!B351,IF($I$3=$M$5,'SP Welded'!B351,\"\")))","v":11},{"$f":"IF($I$3=$M$3,'SP Plus Bolted'!C351,IF($I$3=$M$4,'SP Bolted'!C351,IF($I$3=$M$5,'SP Welded'!C351,\"\")))","v":15.5}]
[{"$f":"IF($I$3=$M$3,'SP Plus Bolted'!A352,IF($I$3=$M$4,'SP Bolted'!A352,IF($I$3=$M$5,'SP Welded'!A352,\"\")))","v":"HSS12X12X5/8"},{"$f":"IF($I$3=$M$3,'SP Plus Bolted'!B352,IF($I$3=$M$4,'SP Bolted'!B352,IF($I$3=$M$5,'SP Welded'!B352,\"\")))","v":11},{"$f":"IF($I$3=$M$3,'SP Plus Bolted'!C352,IF($I$3=$M$4,'SP Bolted'!C352,IF($I$3=$M$5,'SP Welded'!C352,\"\")))","v":15.5}]
[{"$f":"IF($I$3=$M$3,'SP Plus Bolted'!A353,IF($I$3=$M$4,'SP Bolted'!A353,IF($I$3=$M$5,'SP Welded'!A353,\"\")))","v":"HSS12X12X1/2"},{"$f":"IF($I$3=$M$3,'SP Plus Bolted'!B353,IF($I$3=$M$4,'SP Bolted'!B353,IF($I$3=$M$5,'SP Welded'!B353,\"\")))","v":11},{"$f":"IF($I$3=$M$3,'SP Plus Bolted'!C353,IF($I$3=$M$4,'SP Bolted'!C353,IF($I$3=$M$5,'SP Welded'!C353,\"\")))","v":15.5}]
[{"$f":"IF($I$3=$M$3,'SP Plus Bolted'!A354,IF($I$3=$M$4,'SP Bolted'!A354,IF($I$3=$M$5,'SP Welded'!A354,\"\")))","v":"HSS12X12X3/8"},{"$f":"IF($I$3=$M$3,'SP Plus Bolted'!B354,IF($I$3=$M$4,'SP Bolted'!B354,IF($I$3=$M$5,'SP Welded'!B354,\"\")))","v":11},{"$f":"IF($I$3=$M$3,'SP Plus Bolted'!C354,IF($I$3=$M$4,'SP Bolted'!C354,IF($I$3=$M$5,'SP Welded'!C354,\"\")))","v":15.5}]
[{"$f":"IF($I$3=$M$3,'SP Plus Bolted'!A355,IF($I$3=$M$4,'SP Bolted'!A355,IF($I$3=$M$5,'SP Welded'!A355,\"\")))","v":"HSS12X12X5/16"},{"$f":"IF($I$3=$M$3,'SP Plus Bolted'!B355,IF($I$3=$M$4,'SP Bolted'!B355,IF($I$3=$M$5,'SP Welded'!B355,\"\")))","v":11},{"$f":"IF($I$3=$M$3,'SP Plus Bolted'!C355,IF($I$3=$M$4,'SP Bolted'!C355,IF($I$3=$M$5,'SP Welded'!C355,\"\")))","v":15.5}]
[{"$f":"IF($I$3=$M$3,'SP Plus Bolted'!A356,IF($I$3=$M$4,'SP Bolted'!A356,IF($I$3=$M$5,'SP Welded'!A356,\"\")))","v":"HSS12X12X1/4"},{"$f":"IF($I$3=$M$3,'SP Plus Bolted'!B356,IF($I$3=$M$4,'SP Bolted'!B356,IF($I$3=$M$5,'SP Welded'!B356,\"\")))","v":11},{"$f":"IF($I$3=$M$3,'SP Plus Bolted'!C356,IF($I$3=$M$4,'SP Bolted'!C356,IF($I$3=$M$5,'SP Welded'!C356,\"\")))","v":15.5}]
[{"$f":"IF($I$3=$M$3,'SP Plus Bolted'!A357,IF($I$3=$M$4,'SP Bolted'!A357,IF($I$3=$M$5,'SP Welded'!A357,\"\")))","v":"HSS12X10X1/2"},{"$f":"IF($I$3=$M$3,'SP Plus Bolted'!B357,IF($I$3=$M$4,'SP Bolted'!B357,IF($I$3=$M$5,'SP Welded'!B357,\"\")))","v":11},{"$f":"IF($I$3=$M$3,'SP Plus Bolted'!C357,IF($I$3=$M$4,'SP Bolted'!C357,IF($I$3=$M$5,'SP Welded'!C357,\"\")))","v":15.5}]
[{"$f":"IF($I$3=$M$3,'SP Plus Bolted'!A358,IF($I$3=$M$4,'SP Bolted'!A358,IF($I$3=$M$5,'SP Welded'!A358,\"\")))","v":"HSS12X10X3/8"},{"$f":"IF($I$3=$M$3,'SP Plus Bolted'!B358,IF($I$3=$M$4,'SP Bolted'!B358,IF($I$3=$M$5,'SP Welded'!B358,\"\")))","v":11},{"$f":"IF($I$3=$M$3,'SP Plus Bolted'!C358,IF($I$3=$M$4,'SP Bolted'!C358,IF($I$3=$M$5,'SP Welded'!C358,\"\")))","v":15.5}]
[{"$f":"IF($I$3=$M$3,'SP Plus Bolted'!A359,IF($I$3=$M$4,'SP Bolted'!A359,IF($I$3=$M$5,'SP Welded'!A359,\"\")))","v":"HSS12X10X5/16"},{"$f":"IF($I$3=$M$3,'SP Plus Bolted'!B359,IF($I$3=$M$4,'SP Bolted'!B359,IF($I$3=$M$5,'SP Welded'!B359,\"\")))","v":11},{"$f":"IF($I$3=$M$3,'SP Plus Bolted'!C359,IF($I$3=$M$4,'SP Bolted'!C359,IF($I$3=$M$5,'SP Welded'!C359,\"\")))","v":15.5}]
[{"$f":"IF($I$3=$M$3,'SP Plus Bolted'!A360,IF($I$3=$M$4,'SP Bolted'!A360,IF($I$3=$M$5,'SP Welded'!A360,\"\")))","v":"HSS12X10X1/4"},{"$f":"IF($I$3=$M$3,'SP Plus Bolted'!B360,IF($I$3=$M$4,'SP Bolted'!B360,IF($I$3=$M$5,'SP Welded'!B360,\"\")))","v":11},{"$f":"IF($I$3=$M$3,'SP Plus Bolted'!C360,IF($I$3=$M$4,'SP Bolted'!C360,IF($I$3=$M$5,'SP Welded'!C360,\"\")))","v":15.5}]
[{"$f":"IF($I$3=$M$3,'SP Plus Bolted'!A361,IF($I$3=$M$4,'SP Bolted'!A361,IF($I$3=$M$5,'SP Welded'!A361,\"\")))","v":"HSS12X8X5/8"},{"$f":"IF($I$3=$M$3,'SP Plus Bolted'!B361,IF($I$3=$M$4,'SP Bolted'!B361,IF($I$3=$M$5,'SP Welded'!B361,\"\")))","v":11},{"$f":"IF($I$3=$M$3,'SP Plus Bolted'!C361,IF($I$3=$M$4,'SP Bolted'!C361,IF($I$3=$M$5,'SP Welded'!C361,\"\")))","v":15.5}]
[{"$f":"IF($I$3=$M$3,'SP Plus Bolted'!A362,IF($I$3=$M$4,'SP Bolted'!A362,IF($I$3=$M$5,'SP Welded'!A362,\"\")))","v":"HSS12X8X1/2"},{"$f":"IF($I$3=$M$3,'SP Plus Bolted'!B362,IF($I$3=$M$4,'SP Bolted'!B362,IF($I$3=$M$5,'SP Welded'!B362,\"\")))","v":11},{"$f":"IF($I$3=$M$3,'SP Plus Bolted'!C362,IF($I$3=$M$4,'SP Bolted'!C362,IF($I$3=$M$5,'SP Welded'!C362,\"\")))","v":15.5}]
[{"$f":"IF($I$3=$M$3,'SP Plus Bolted'!A363,IF($I$3=$M$4,'SP Bolted'!A363,IF($I$3=$M$5,'SP Welded'!A363,\"\")))","v":"HSS12X8X3/8"},{"$f":"IF($I$3=$M$3,'SP Plus Bolted'!B363,IF($I$3=$M$4,'SP Bolted'!B363,IF($I$3=$M$5,'SP Welded'!B363,\"\")))","v":11},{"$f":"IF($I$3=$M$3,'SP Plus Bolted'!C363,IF($I$3=$M$4,'SP Bolted'!C363,IF($I$3=$M$5,'SP Welded'!C363,\"\")))","v":15.5}]
[{"$f":"IF($I$3=$M$3,'SP Plus Bolted'!A364,IF($I$3=$M$4,'SP Bolted'!A364,IF($I$3=$M$5,'SP Welded'!A364,\"\")))","v":"HSS12X8X5/16"},{"$f":"IF($I$3=$M$3,'SP Plus Bolted'!B364,IF($I$3=$M$4,'SP Bolted'!B364,IF($I$3=$M$5,'SP Welded'!B364,\"\")))","v":11},{"$f":"IF($I$3=$M$3,'SP Plus Bolted'!C364,IF($I$3=$M$4,'SP Bolted'!C364,IF($I$3=$M$5,'SP Welded'!C364,\"\")))","v":15.5}]
[{"$f":"IF($I$3=$M$3,'SP Plus Bolted'!A365,IF($I$3=$M$4,'SP Bolted'!A365,IF($I$3=$M$5,'SP Welded'!A365,\"\")))","v":"HSS12X8X1/4"},{"$f":"IF($I$3=$M$3,'SP Plus Bolted'!B365,IF($I$3=$M$4,'SP Bolted'!B365,IF($I$3=$M$5,'SP Welded'!B365,\"\")))","v":11},{"$f":"IF($I$3=$M$3,'SP Plus Bolted'!C365,IF($I$3=$M$4,'SP Bolted'!C365,IF($I$3=$M$5,'SP Welded'!C365,\"\")))","v":15.5}]
[{"$f":"IF($I$3=$M$3,'SP Plus Bolted'!A366,IF($I$3=$M$4,'SP Bolted'!A366,IF($I$3=$M$5,'SP Welded'!A366,\"\")))","v":"HSS12X8X3/16"},{"$f":"IF($I$3=$M$3,'SP Plus Bolted'!B366,IF($I$3=$M$4,'SP Bolted'!B366,IF($I$3=$M$5,'SP Welded'!B366,\"\")))","v":11},{"$f":"IF($I$3=$M$3,'SP Plus Bolted'!C366,IF($I$3=$M$4,'SP Bolted'!C366,IF($I$3=$M$5,'SP Welded'!C366,\"\")))","v":15.5}]
[{"$f":"IF($I$3=$M$3,'SP Plus Bolted'!A367,IF($I$3=$M$4,'SP Bolted'!A367,IF($I$3=$M$5,'SP Welded'!A367,\"\")))","v":"HSS12X6X5/8"},{"$f":"IF($I$3=$M$3,'SP Plus Bolted'!B367,IF($I$3=$M$4,'SP Bolted'!B367,IF($I$3=$M$5,'SP Welded'!B367,\"\")))","v":11},{"$f":"IF($I$3=$M$3,'SP Plus Bolted'!C367,IF($I$3=$M$4,'SP Bolted'!C367,IF($I$3=$M$5,'SP Welded'!C367,\"\")))","v":15.5}]
[{"$f":"IF($I$3=$M$3,'SP Plus Bolted'!A368,IF($I$3=$M$4,'SP Bolted'!A368,IF($I$3=$M$5,'SP Welded'!A368,\"\")))","v":"HSS12X6X1/2"},{"$f":"IF($I$3=$M$3,'SP Plus Bolted'!B368,IF($I$3=$M$4,'SP Bolted'!B368,IF($I$3=$M$5,'SP Welded'!B368,\"\")))","v":11},{"$f":"IF($I$3=$M$3,'SP Plus Bolted'!C368,IF($I$3=$M$4,'SP Bolted'!C368,IF($I$3=$M$5,'SP Welded'!C368,\"\")))","v":15.5}]
[{"$f":"IF($I$3=$M$3,'SP Plus Bolted'!A369,IF($I$3=$M$4,'SP Bolted'!A369,IF($I$3=$M$5,'SP Welded'!A369,\"\")))","v":"HSS12X6X3/8"},{"$f":"IF($I$3=$M$3,'SP Plus Bolted'!B369,IF($I$3=$M$4,'SP Bolted'!B369,IF($I$3=$M$5,'SP Welded'!B369,\"\")))","v":11},{"$f":"IF($I$3=$M$3,'SP Plus Bolted'!C369,IF($I$3=$M$4,'SP Bolted'!C369,IF($I$3=$M$5,'SP Welded'!C369,\"\")))","v":15.5}]
[{"$f":"IF($I$3=$M$3,'SP Plus Bolted'!A370,IF($I$3=$M$4,'SP Bolted'!A370,IF($I$3=$M$5,'SP Welded'!A370,\"\")))","v":"HSS12X6X5/16"},{"$f":"IF($I$3=$M$3,'SP Plus Bolted'!B370,IF($I$3=$M$4,'SP Bolted'!B370,IF($I$3=$M$5,'SP Welded'!B370,\"\")))","v":11},{"$f":"IF($I$3=$M$3,'SP Plus Bolted'!C370,IF($I$3=$M$4,'SP Bolted'!C370,IF($I$3=$M$5,'SP Welded'!C370,\"\")))","v":15.5}]
[{"$f":"IF($I$3=$M$3,'SP Plus Bolted'!A371,IF($I$3=$M$4,'SP Bolted'!A371,IF($I$3=$M$5,'SP Welded'!A371,\"\")))","v":"HSS12X6X1/4"},{"$f":"IF($I$3=$M$3,'SP Plus Bolted'!B371,IF($I$3=$M$4,'SP Bolted'!B371,IF($I$3=$M$5,'SP Welded'!B371,\"\")))","v":11},{"$f":"IF($I$3=$M$3,'SP Plus Bolted'!C371,IF($I$3=$M$4,'SP Bolted'!C371,IF($I$3=$M$5,'SP Welded'!C371,\"\")))","v":15.5}]
[{"$f":"IF($I$3=$M$3,'SP Plus Bolted'!A372,IF($I$3=$M$4,'SP Bolted'!A372,IF($I$3=$M$5,'SP Welded'!A372,\"\")))","v":"HSS12X6X3/16"},{"$f":"IF($I$3=$M$3,'SP Plus Bolted'!B372,IF($I$3=$M$4,'SP Bolted'!B372,IF($I$3=$M$5,'SP Welded'!B372,\"\")))","v":11},{"$f":"IF($I$3=$M$3,'SP Plus Bolted'!C372,IF($I$3=$M$4,'SP Bolted'!C372,IF($I$3=$M$5,'SP Welded'!C372,\"\")))","v":15.5}]
[{"$f":"IF($I$3=$M$3,'SP Plus Bolted'!A373,IF($I$3=$M$4,'SP Bolted'!A373,IF($I$3=$M$5,'SP Welded'!A373,\"\")))","v":"HSS12X4X5/8"},{"$f":"IF($I$3=$M$3,'SP Plus Bolted'!B373,IF($I$3=$M$4,'SP Bolted'!B373,IF($I$3=$M$5,'SP Welded'!B373,\"\")))","v":11},{"$f":"IF($I$3=$M$3,'SP Plus Bolted'!C373,IF($I$3=$M$4,'SP Bolted'!C373,IF($I$3=$M$5,'SP Welded'!C373,\"\")))","v":15.5}]
[{"$f":"IF($I$3=$M$3,'SP Plus Bolted'!A374,IF($I$3=$M$4,'SP Bolted'!A374,IF($I$3=$M$5,'SP Welded'!A374,\"\")))","v":"HSS12X4X1/2"},{"$f":"IF($I$3=$M$3,'SP Plus Bolted'!B374,IF($I$3=$M$4,'SP Bolted'!B374,IF($I$3=$M$5,'SP Welded'!B374,\"\")))","v":11},{"$f":"IF($I$3=$M$3,'SP Plus Bolted'!C374,IF($I$3=$M$4,'SP Bolted'!C374,IF($I$3=$M$5,'SP Welded'!C374,\"\")))","v":15.5}]
[{"$f":"IF($I$3=$M$3,'SP Plus Bolted'!A375,IF($I$3=$M$4,'SP Bolted'!A375,IF($I$3=$M$5,'SP Welded'!A375,\"\")))","v":"HSS12X4X3/8"},{"$f":"IF($I$3=$M$3,'SP Plus Bolted'!B375,IF($I$3=$M$4,'SP Bolted'!B375,IF($I$3=$M$5,'SP Welded'!B375,\"\")))","v":11},{"$f":"IF($I$3=$M$3,'SP Plus Bolted'!C375,IF($I$3=$M$4,'SP Bolted'!C375,IF($I$3=$M$5,'SP Welded'!C375,\"\")))","v":15.5}]
[{"$f":"IF($I$3=$M$3,'SP Plus Bolted'!A376,IF($I$3=$M$4,'SP Bolted'!A376,IF($I$3=$M$5,'SP Welded'!A376,\"\")))","v":"HSS12X4X5/16"},{"$f":"IF($I$3=$M$3,'SP Plus Bolted'!B376,IF($I$3=$M$4,'SP Bolted'!B376,IF($I$3=$M$5,'SP Welded'!B376,\"\")))","v":11},{"$f":"IF($I$3=$M$3,'SP Plus Bolted'!C376,IF($I$3=$M$4,'SP Bolted'!C376,IF($I$3=$M$5,'SP Welded'!C376,\"\")))","v":15.5}]
[{"$f":"IF($I$3=$M$3,'SP Plus Bolted'!A377,IF($I$3=$M$4,'SP Bolted'!A377,IF($I$3=$M$5,'SP Welded'!A377,\"\")))","v":"HSS12X4X1/4"},{"$f":"IF($I$3=$M$3,'SP Plus Bolted'!B377,IF($I$3=$M$4,'SP Bolted'!B377,IF($I$3=$M$5,'SP Welded'!B377,\"\")))","v":11},{"$f":"IF($I$3=$M$3,'SP Plus Bolted'!C377,IF($I$3=$M$4,'SP Bolted'!C377,IF($I$3=$M$5,'SP Welded'!C377,\"\")))","v":15.5}]
[{"$f":"IF($I$3=$M$3,'SP Plus Bolted'!A378,IF($I$3=$M$4,'SP Bolted'!A378,IF($I$3=$M$5,'SP Welded'!A378,\"\")))","v":"HSS12X4X3/16"},{"$f":"IF($I$3=$M$3,'SP Plus Bolted'!B378,IF($I$3=$M$4,'SP Bolted'!B378,IF($I$3=$M$5,'SP Welded'!B378,\"\")))","v":11},{"$f":"IF($I$3=$M$3,'SP Plus Bolted'!C378,IF($I$3=$M$4,'SP Bolted'!C378,IF($I$3=$M$5,'SP Welded'!C378,\"\")))","v":15.5}]
[{"$f":"IF($I$3=$M$3,'SP Plus Bolted'!A379,IF($I$3=$M$4,'SP Bolted'!A379,IF($I$3=$M$5,'SP Welded'!A379,\"\")))","v":"HSS12X3-1/2X3/8"},{"$f":"IF($I$3=$M$3,'SP Plus Bolted'!B379,IF($I$3=$M$4,'SP Bolted'!B379,IF($I$3=$M$5,'SP Welded'!B379,\"\")))","v":11},{"$f":"IF($I$3=$M$3,'SP Plus Bolted'!C379,IF($I$3=$M$4,'SP Bolted'!C379,IF($I$3=$M$5,'SP Welded'!C379,\"\")))","v":15.5}]
[{"$f":"IF($I$3=$M$3,'SP Plus Bolted'!A380,IF($I$3=$M$4,'SP Bolted'!A380,IF($I$3=$M$5,'SP Welded'!A380,\"\")))","v":"HSS12X3-1/2X5/16"},{"$f":"IF($I$3=$M$3,'SP Plus Bolted'!B380,IF($I$3=$M$4,'SP Bolted'!B380,IF($I$3=$M$5,'SP Welded'!B380,\"\")))","v":11},{"$f":"IF($I$3=$M$3,'SP Plus Bolted'!C380,IF($I$3=$M$4,'SP Bolted'!C380,IF($I$3=$M$5,'SP Welded'!C380,\"\")))","v":15.5}]
[{"$f":"IF($I$3=$M$3,'SP Plus Bolted'!A381,IF($I$3=$M$4,'SP Bolted'!A381,IF($I$3=$M$5,'SP Welded'!A381,\"\")))","v":"HSS12X3X5/16"},{"$f":"IF($I$3=$M$3,'SP Plus Bolted'!B381,IF($I$3=$M$4,'SP Bolted'!B381,IF($I$3=$M$5,'SP Welded'!B381,\"\")))","v":11},{"$f":"IF($I$3=$M$3,'SP Plus Bolted'!C381,IF($I$3=$M$4,'SP Bolted'!C381,IF($I$3=$M$5,'SP Welded'!C381,\"\")))","v":15.5}]
[{"$f":"IF($I$3=$M$3,'SP Plus Bolted'!A382,IF($I$3=$M$4,'SP Bolted'!A382,IF($I$3=$M$5,'SP Welded'!A382,\"\")))","v":"HSS12X3X1/4"},{"$f":"IF($I$3=$M$3,'SP Plus Bolted'!B382,IF($I$3=$M$4,'SP Bolted'!B382,IF($I$3=$M$5,'SP Welded'!B382,\"\")))","v":11},{"$f":"IF($I$3=$M$3,'SP Plus Bolted'!C382,IF($I$3=$M$4,'SP Bolted'!C382,IF($I$3=$M$5,'SP Welded'!C382,\"\")))","v":15.5}]
[{"$f":"IF($I$3=$M$3,'SP Plus Bolted'!A383,IF($I$3=$M$4,'SP Bolted'!A383,IF($I$3=$M$5,'SP Welded'!A383,\"\")))","v":"HSS12X3X3/16"},{"$f":"IF($I$3=$M$3,'SP Plus Bolted'!B383,IF($I$3=$M$4,'SP Bolted'!B383,IF($I$3=$M$5,'SP Welded'!B383,\"\")))","v":11},{"$f":"IF($I$3=$M$3,'SP Plus Bolted'!C383,IF($I$3=$M$4,'SP Bolted'!C383,IF($I$3=$M$5,'SP Welded'!C383,\"\")))","v":15.5}]
[{"$f":"IF($I$3=$M$3,'SP Plus Bolted'!A384,IF($I$3=$M$4,'SP Bolted'!A384,IF($I$3=$M$5,'SP Welded'!A384,\"\")))","v":"HSS12X2X5/16"},{"$f":"IF($I$3=$M$3,'SP Plus Bolted'!B384,IF($I$3=$M$4,'SP Bolted'!B384,IF($I$3=$M$5,'SP Welded'!B384,\"\")))","v":11},{"$f":"IF($I$3=$M$3,'SP Plus Bolted'!C384,IF($I$3=$M$4,'SP Bolted'!C384,IF($I$3=$M$5,'SP Welded'!C384,\"\")))","v":15.5}]
[{"$f":"IF($I$3=$M$3,'SP Plus Bolted'!A385,IF($I$3=$M$4,'SP Bolted'!A385,IF($I$3=$M$5,'SP Welded'!A385,\"\")))","v":"HSS12X2X1/4"},{"$f":"IF($I$3=$M$3,'SP Plus Bolted'!B385,IF($I$3=$M$4,'SP Bolted'!B385,IF($I$3=$M$5,'SP Welded'!B385,\"\")))","v":11},{"$f":"IF($I$3=$M$3,'SP Plus Bolted'!C385,IF($I$3=$M$4,'SP Bolted'!C385,IF($I$3=$M$5,'SP Welded'!C385,\"\")))","v":15.5}]
[{"$f":"IF($I$3=$M$3,'SP Plus Bolted'!A386,IF($I$3=$M$4,'SP Bolted'!A386,IF($I$3=$M$5,'SP Welded'!A386,\"\")))","v":"HSS12X2X3/16"},{"$f":"IF($I$3=$M$3,'SP Plus Bolted'!B386,IF($I$3=$M$4,'SP Bolted'!B386,IF($I$3=$M$5,'SP Welded'!B386,\"\")))","v":11},{"$f":"IF($I$3=$M$3,'SP Plus Bolted'!C386,IF($I$3=$M$4,'SP Bolted'!C386,IF($I$3=$M$5,'SP Welded'!C386,\"\")))","v":15.5}]
[{"$f":"IF($I$3=$M$3,'SP Plus Bolted'!A387,IF($I$3=$M$4,'SP Bolted'!A387,IF($I$3=$M$5,'SP Welded'!A387,\"\")))","v":"HSS10X10X3/4"},{"$f":"IF($I$3=$M$3,'SP Plus Bolted'!B387,IF($I$3=$M$4,'SP Bolted'!B387,IF($I$3=$M$5,'SP Welded'!B387,\"\")))","v":11},{"$f":"IF($I$3=$M$3,'SP Plus Bolted'!C387,IF($I$3=$M$4,'SP Bolted'!C387,IF($I$3=$M$5,'SP Welded'!C387,\"\")))","v":13.5}]
[{"$f":"IF($I$3=$M$3,'SP Plus Bolted'!A388,IF($I$3=$M$4,'SP Bolted'!A388,IF($I$3=$M$5,'SP Welded'!A388,\"\")))","v":"HSS10X10X5/8"},{"$f":"IF($I$3=$M$3,'SP Plus Bolted'!B388,IF($I$3=$M$4,'SP Bolted'!B388,IF($I$3=$M$5,'SP Welded'!B388,\"\")))","v":11},{"$f":"IF($I$3=$M$3,'SP Plus Bolted'!C388,IF($I$3=$M$4,'SP Bolted'!C388,IF($I$3=$M$5,'SP Welded'!C388,\"\")))","v":13.5}]
[{"$f":"IF($I$3=$M$3,'SP Plus Bolted'!A389,IF($I$3=$M$4,'SP Bolted'!A389,IF($I$3=$M$5,'SP Welded'!A389,\"\")))","v":"HSS10X10X1/2"},{"$f":"IF($I$3=$M$3,'SP Plus Bolted'!B389,IF($I$3=$M$4,'SP Bolted'!B389,IF($I$3=$M$5,'SP Welded'!B389,\"\")))","v":11},{"$f":"IF($I$3=$M$3,'SP Plus Bolted'!C389,IF($I$3=$M$4,'SP Bolted'!C389,IF($I$3=$M$5,'SP Welded'!C389,\"\")))","v":13.5}]
[{"$f":"IF($I$3=$M$3,'SP Plus Bolted'!A390,IF($I$3=$M$4,'SP Bolted'!A390,IF($I$3=$M$5,'SP Welded'!A390,\"\")))","v":"HSS10X10X3/8"},{"$f":"IF($I$3=$M$3,'SP Plus Bolted'!B390,IF($I$3=$M$4,'SP Bolted'!B390,IF($I$3=$M$5,'SP Welded'!B390,\"\")))","v":11},{"$f":"IF($I$3=$M$3,'SP Plus Bolted'!C390,IF($I$3=$M$4,'SP Bolted'!C390,IF($I$3=$M$5,'SP Welded'!C390,\"\")))","v":13.5}]
[{"$f":"IF($I$3=$M$3,'SP Plus Bolted'!A391,IF($I$3=$M$4,'SP Bolted'!A391,IF($I$3=$M$5,'SP Welded'!A391,\"\")))","v":"HSS10X10X5/16"},{"$f":"IF($I$3=$M$3,'SP Plus Bolted'!B391,IF($I$3=$M$4,'SP Bolted'!B391,IF($I$3=$M$5,'SP Welded'!B391,\"\")))","v":11},{"$f":"IF($I$3=$M$3,'SP Plus Bolted'!C391,IF($I$3=$M$4,'SP Bolted'!C391,IF($I$3=$M$5,'SP Welded'!C391,\"\")))","v":13.5}]
[{"$f":"IF($I$3=$M$3,'SP Plus Bolted'!A392,IF($I$3=$M$4,'SP Bolted'!A392,IF($I$3=$M$5,'SP Welded'!A392,\"\")))","v":"HSS10X10X1/4"},{"$f":"IF($I$3=$M$3,'SP Plus Bolted'!B392,IF($I$3=$M$4,'SP Bolted'!B392,IF($I$3=$M$5,'SP Welded'!B392,\"\")))","v":11},{"$f":"IF($I$3=$M$3,'SP Plus Bolted'!C392,IF($I$3=$M$4,'SP Bolted'!C392,IF($I$3=$M$5,'SP Welded'!C392,\"\")))","v":13.5}]
[{"$f":"IF($I$3=$M$3,'SP Plus Bolted'!A393,IF($I$3=$M$4,'SP Bolted'!A393,IF($I$3=$M$5,'SP Welded'!A393,\"\")))","v":"HSS10X10X3/16"},{"$f":"IF($I$3=$M$3,'SP Plus Bolted'!B393,IF($I$3=$M$4,'SP Bolted'!B393,IF($I$3=$M$5,'SP Welded'!B393,\"\")))","v":11},{"$f":"IF($I$3=$M$3,'SP Plus Bolted'!C393,IF($I$3=$M$4,'SP Bolted'!C393,IF($I$3=$M$5,'SP Welded'!C393,\"\")))","v":13.5}]
[{"$f":"IF($I$3=$M$3,'SP Plus Bolted'!A394,IF($I$3=$M$4,'SP Bolted'!A394,IF($I$3=$M$5,'SP Welded'!A394,\"\")))","v":"HSS10X8X5/8"},{"$f":"IF($I$3=$M$3,'SP Plus Bolted'!B394,IF($I$3=$M$4,'SP Bolted'!B394,IF($I$3=$M$5,'SP Welded'!B394,\"\")))","v":11},{"$f":"IF($I$3=$M$3,'SP Plus Bolted'!C394,IF($I$3=$M$4,'SP Bolted'!C394,IF($I$3=$M$5,'SP Welded'!C394,\"\")))","v":13.5}]
[{"$f":"IF($I$3=$M$3,'SP Plus Bolted'!A395,IF($I$3=$M$4,'SP Bolted'!A395,IF($I$3=$M$5,'SP Welded'!A395,\"\")))","v":"HSS10X8X1/2"},{"$f":"IF($I$3=$M$3,'SP Plus Bolted'!B395,IF($I$3=$M$4,'SP Bolted'!B395,IF($I$3=$M$5,'SP Welded'!B395,\"\")))","v":11},{"$f":"IF($I$3=$M$3,'SP Plus Bolted'!C395,IF($I$3=$M$4,'SP Bolted'!C395,IF($I$3=$M$5,'SP Welded'!C395,\"\")))","v":13.5}]
[{"$f":"IF($I$3=$M$3,'SP Plus Bolted'!A396,IF($I$3=$M$4,'SP Bolted'!A396,IF($I$3=$M$5,'SP Welded'!A396,\"\")))","v":"HSS10X8X3/8"},{"$f":"IF($I$3=$M$3,'SP Plus Bolted'!B396,IF($I$3=$M$4,'SP Bolted'!B396,IF($I$3=$M$5,'SP Welded'!B396,\"\")))","v":11},{"$f":"IF($I$3=$M$3,'SP Plus Bolted'!C396,IF($I$3=$M$4,'SP Bolted'!C396,IF($I$3=$M$5,'SP Welded'!C396,\"\")))","v":13.5}]
[{"$f":"IF($I$3=$M$3,'SP Plus Bolted'!A397,IF($I$3=$M$4,'SP Bolted'!A397,IF($I$3=$M$5,'SP Welded'!A397,\"\")))","v":"HSS10X8X5/16"},{"$f":"IF($I$3=$M$3,'SP Plus Bolted'!B397,IF($I$3=$M$4,'SP Bolted'!B397,IF($I$3=$M$5,'SP Welded'!B397,\"\")))","v":11},{"$f":"IF($I$3=$M$3,'SP Plus Bolted'!C397,IF($I$3=$M$4,'SP Bolted'!C397,IF($I$3=$M$5,'SP Welded'!C397,\"\")))","v":13.5}]
[{"$f":"IF($I$3=$M$3,'SP Plus Bolted'!A398,IF($I$3=$M$4,'SP Bolted'!A398,IF($I$3=$M$5,'SP Welded'!A398,\"\")))","v":"HSS10X8X1/4"},{"$f":"IF($I$3=$M$3,'SP Plus Bolted'!B398,IF($I$3=$M$4,'SP Bolted'!B398,IF($I$3=$M$5,'SP Welded'!B398,\"\")))","v":11},{"$f":"IF($I$3=$M$3,'SP Plus Bolted'!C398,IF($I$3=$M$4,'SP Bolted'!C398,IF($I$3=$M$5,'SP Welded'!C398,\"\")))","v":13.5}]
[{"$f":"IF($I$3=$M$3,'SP Plus Bolted'!A399,IF($I$3=$M$4,'SP Bolted'!A399,IF($I$3=$M$5,'SP Welded'!A399,\"\")))","v":"HSS10X8X3/16"},{"$f":"IF($I$3=$M$3,'SP Plus Bolted'!B399,IF($I$3=$M$4,'SP Bolted'!B399,IF($I$3=$M$5,'SP Welded'!B399,\"\")))","v":11},{"$f":"IF($I$3=$M$3,'SP Plus Bolted'!C399,IF($I$3=$M$4,'SP Bolted'!C399,IF($I$3=$M$5,'SP Welded'!C399,\"\")))","v":13.5}]
[{"$f":"IF($I$3=$M$3,'SP Plus Bolted'!A400,IF($I$3=$M$4,'SP Bolted'!A400,IF($I$3=$M$5,'SP Welded'!A400,\"\")))","v":"HSS10X6X5/8"},{"$f":"IF($I$3=$M$3,'SP Plus Bolted'!B400,IF($I$3=$M$4,'SP Bolted'!B400,IF($I$3=$M$5,'SP Welded'!B400,\"\")))","v":11},{"$f":"IF($I$3=$M$3,'SP Plus Bolted'!C400,IF($I$3=$M$4,'SP Bolted'!C400,IF($I$3=$M$5,'SP Welded'!C400,\"\")))","v":13.5}]
[{"$f":"IF($I$3=$M$3,'SP Plus Bolted'!A401,IF($I$3=$M$4,'SP Bolted'!A401,IF($I$3=$M$5,'SP Welded'!A401,\"\")))","v":"HSS10X6X1/2"},{"$f":"IF($I$3=$M$3,'SP Plus Bolted'!B401,IF($I$3=$M$4,'SP Bolted'!B401,IF($I$3=$M$5,'SP Welded'!B401,\"\")))","v":11},{"$f":"IF($I$3=$M$3,'SP Plus Bolted'!C401,IF($I$3=$M$4,'SP Bolted'!C401,IF($I$3=$M$5,'SP Welded'!C401,\"\")))","v":13.5}]
[{"$f":"IF($I$3=$M$3,'SP Plus Bolted'!A402,IF($I$3=$M$4,'SP Bolted'!A402,IF($I$3=$M$5,'SP Welded'!A402,\"\")))","v":"HSS10X6X3/8"},{"$f":"IF($I$3=$M$3,'SP Plus Bolted'!B402,IF($I$3=$M$4,'SP Bolted'!B402,IF($I$3=$M$5,'SP Welded'!B402,\"\")))","v":11},{"$f":"IF($I$3=$M$3,'SP Plus Bolted'!C402,IF($I$3=$M$4,'SP Bolted'!C402,IF($I$3=$M$5,'SP Welded'!C402,\"\")))","v":13.5}]
[{"$f":"IF($I$3=$M$3,'SP Plus Bolted'!A403,IF($I$3=$M$4,'SP Bolted'!A403,IF($I$3=$M$5,'SP Welded'!A403,\"\")))","v":"HSS10X6X5/16"},{"$f":"IF($I$3=$M$3,'SP Plus Bolted'!B403,IF($I$3=$M$4,'SP Bolted'!B403,IF($I$3=$M$5,'SP Welded'!B403,\"\")))","v":11},{"$f":"IF($I$3=$M$3,'SP Plus Bolted'!C403,IF($I$3=$M$4,'SP Bolted'!C403,IF($I$3=$M$5,'SP Welded'!C403,\"\")))","v":13.5}]
[{"$f":"IF($I$3=$M$3,'SP Plus Bolted'!A404,IF($I$3=$M$4,'SP Bolted'!A404,IF($I$3=$M$5,'SP Welded'!A404,\"\")))","v":"HSS10X6X1/4"},{"$f":"IF($I$3=$M$3,'SP Plus Bolted'!B404,IF($I$3=$M$4,'SP Bolted'!B404,IF($I$3=$M$5,'SP Welded'!B404,\"\")))","v":11},{"$f":"IF($I$3=$M$3,'SP Plus Bolted'!C404,IF($I$3=$M$4,'SP Bolted'!C404,IF($I$3=$M$5,'SP Welded'!C404,\"\")))","v":13.5}]
[{"$f":"IF($I$3=$M$3,'SP Plus Bolted'!A405,IF($I$3=$M$4,'SP Bolted'!A405,IF($I$3=$M$5,'SP Welded'!A405,\"\")))","v":"HSS10X6X3/16"},{"$f":"IF($I$3=$M$3,'SP Plus Bolted'!B405,IF($I$3=$M$4,'SP Bolted'!B405,IF($I$3=$M$5,'SP Welded'!B405,\"\")))","v":11},{"$f":"IF($I$3=$M$3,'SP Plus Bolted'!C405,IF($I$3=$M$4,'SP Bolted'!C405,IF($I$3=$M$5,'SP Welded'!C405,\"\")))","v":13.5}]
[{"$f":"IF($I$3=$M$3,'SP Plus Bolted'!A406,IF($I$3=$M$4,'SP Bolted'!A406,IF($I$3=$M$5,'SP Welded'!A406,\"\")))","v":"HSS10X5X3/8"},{"$f":"IF($I$3=$M$3,'SP Plus Bolted'!B406,IF($I$3=$M$4,'SP Bolted'!B406,IF($I$3=$M$5,'SP Welded'!B406,\"\")))","v":11},{"$f":"IF($I$3=$M$3,'SP Plus Bolted'!C406,IF($I$3=$M$4,'SP Bolted'!C406,IF($I$3=$M$5,'SP Welded'!C406,\"\")))","v":13.5}]
[{"$f":"IF($I$3=$M$3,'SP Plus Bolted'!A407,IF($I$3=$M$4,'SP Bolted'!A407,IF($I$3=$M$5,'SP Welded'!A407,\"\")))","v":"HSS10X5X5/16"},{"$f":"IF($I$3=$M$3,'SP Plus Bolted'!B407,IF($I$3=$M$4,'SP Bolted'!B407,IF($I$3=$M$5,'SP Welded'!B407,\"\")))","v":11},{"$f":"IF($I$3=$M$3,'SP Plus Bolted'!C407,IF($I$3=$M$4,'SP Bolted'!C407,IF($I$3=$M$5,'SP Welded'!C407,\"\")))","v":13.5}]
[{"$f":"IF($I$3=$M$3,'SP Plus Bolted'!A408,IF($I$3=$M$4,'SP Bolted'!A408,IF($I$3=$M$5,'SP Welded'!A408,\"\")))","v":"HSS10X5X1/4"},{"$f":"IF($I$3=$M$3,'SP Plus Bolted'!B408,IF($I$3=$M$4,'SP Bolted'!B408,IF($I$3=$M$5,'SP Welded'!B408,\"\")))","v":11},{"$f":"IF($I$3=$M$3,'SP Plus Bolted'!C408,IF($I$3=$M$4,'SP Bolted'!C408,IF($I$3=$M$5,'SP Welded'!C408,\"\")))","v":13.5}]
[{"$f":"IF($I$3=$M$3,'SP Plus Bolted'!A409,IF($I$3=$M$4,'SP Bolted'!A409,IF($I$3=$M$5,'SP Welded'!A409,\"\")))","v":"HSS10X5X3/16"},{"$f":"IF($I$3=$M$3,'SP Plus Bolted'!B409,IF($I$3=$M$4,'SP Bolted'!B409,IF($I$3=$M$5,'SP Welded'!B409,\"\")))","v":11},{"$f":"IF($I$3=$M$3,'SP Plus Bolted'!C409,IF($I$3=$M$4,'SP Bolted'!C409,IF($I$3=$M$5,'SP Welded'!C409,\"\")))","v":13.5}]
[{"$f":"IF($I$3=$M$3,'SP Plus Bolted'!A410,IF($I$3=$M$4,'SP Bolted'!A410,IF($I$3=$M$5,'SP Welded'!A410,\"\")))","v":"HSS10X4X5/8"},{"$f":"IF($I$3=$M$3,'SP Plus Bolted'!B410,IF($I$3=$M$4,'SP Bolted'!B410,IF($I$3=$M$5,'SP Welded'!B410,\"\")))","v":11},{"$f":"IF($I$3=$M$3,'SP Plus Bolted'!C410,IF($I$3=$M$4,'SP Bolted'!C410,IF($I$3=$M$5,'SP Welded'!C410,\"\")))","v":13.5}]
[{"$f":"IF($I$3=$M$3,'SP Plus Bolted'!A411,IF($I$3=$M$4,'SP Bolted'!A411,IF($I$3=$M$5,'SP Welded'!A411,\"\")))","v":"HSS10X4X1/2"},{"$f":"IF($I$3=$M$3,'SP Plus Bolted'!B411,IF($I$3=$M$4,'SP Bolted'!B411,IF($I$3=$M$5,'SP Welded'!B411,\"\")))","v":11},{"$f":"IF($I$3=$M$3,'SP Plus Bolted'!C411,IF($I$3=$M$4,'SP Bolted'!C411,IF($I$3=$M$5,'SP Welded'!C411,\"\")))","v":13.5}]
[{"$f":"IF($I$3=$M$3,'SP Plus Bolted'!A412,IF($I$3=$M$4,'SP Bolted'!A412,IF($I$3=$M$5,'SP Welded'!A412,\"\")))","v":"HSS10X4X3/8"},{"$f":"IF($I$3=$M$3,'SP Plus Bolted'!B412,IF($I$3=$M$4,'SP Bolted'!B412,IF($I$3=$M$5,'SP Welded'!B412,\"\")))","v":11},{"$f":"IF($I$3=$M$3,'SP Plus Bolted'!C412,IF($I$3=$M$4,'SP Bolted'!C412,IF($I$3=$M$5,'SP Welded'!C412,\"\")))","v":13.5}]
[{"$f":"IF($I$3=$M$3,'SP Plus Bolted'!A413,IF($I$3=$M$4,'SP Bolted'!A413,IF($I$3=$M$5,'SP Welded'!A413,\"\")))","v":"HSS10X4X5/16"},{"$f":"IF($I$3=$M$3,'SP Plus Bolted'!B413,IF($I$3=$M$4,'SP Bolted'!B413,IF($I$3=$M$5,'SP Welded'!B413,\"\")))","v":11},{"$f":"IF($I$3=$M$3,'SP Plus Bolted'!C413,IF($I$3=$M$4,'SP Bolted'!C413,IF($I$3=$M$5,'SP Welded'!C413,\"\")))","v":13.5}]
[{"$f":"IF($I$3=$M$3,'SP Plus Bolted'!A414,IF($I$3=$M$4,'SP Bolted'!A414,IF($I$3=$M$5,'SP Welded'!A414,\"\")))","v":"HSS10X4X1/4"},{"$f":"IF($I$3=$M$3,'SP Plus Bolted'!B414,IF($I$3=$M$4,'SP Bolted'!B414,IF($I$3=$M$5,'SP Welded'!B414,\"\")))","v":11},{"$f":"IF($I$3=$M$3,'SP Plus Bolted'!C414,IF($I$3=$M$4,'SP Bolted'!C414,IF($I$3=$M$5,'SP Welded'!C414,\"\")))","v":13.5}]
[{"$f":"IF($I$3=$M$3,'SP Plus Bolted'!A415,IF($I$3=$M$4,'SP Bolted'!A415,IF($I$3=$M$5,'SP Welded'!A415,\"\")))","v":"HSS10X4X3/16"},{"$f":"IF($I$3=$M$3,'SP Plus Bolted'!B415,IF($I$3=$M$4,'SP Bolted'!B415,IF($I$3=$M$5,'SP Welded'!B415,\"\")))","v":11},{"$f":"IF($I$3=$M$3,'SP Plus Bolted'!C415,IF($I$3=$M$4,'SP Bolted'!C415,IF($I$3=$M$5,'SP Welded'!C415,\"\")))","v":13.5}]
[{"$f":"IF($I$3=$M$3,'SP Plus Bolted'!A416,IF($I$3=$M$4,'SP Bolted'!A416,IF($I$3=$M$5,'SP Welded'!A416,\"\")))","v":"HSS10X4X1/8"},{"$f":"IF($I$3=$M$3,'SP Plus Bolted'!B416,IF($I$3=$M$4,'SP Bolted'!B416,IF($I$3=$M$5,'SP Welded'!B416,\"\")))","v":11},{"$f":"IF($I$3=$M$3,'SP Plus Bolted'!C416,IF($I$3=$M$4,'SP Bolted'!C416,IF($I$3=$M$5,'SP Welded'!C416,\"\")))","v":13.5}]
[{"$f":"IF($I$3=$M$3,'SP Plus Bolted'!A417,IF($I$3=$M$4,'SP Bolted'!A417,IF($I$3=$M$5,'SP Welded'!A417,\"\")))","v":"HSS10X3-1/2X1/2"},{"$f":"IF($I$3=$M$3,'SP Plus Bolted'!B417,IF($I$3=$M$4,'SP Bolted'!B417,IF($I$3=$M$5,'SP Welded'!B417,\"\")))","v":11},{"$f":"IF($I$3=$M$3,'SP Plus Bolted'!C417,IF($I$3=$M$4,'SP Bolted'!C417,IF($I$3=$M$5,'SP Welded'!C417,\"\")))","v":13.5}]
[{"$f":"IF($I$3=$M$3,'SP Plus Bolted'!A418,IF($I$3=$M$4,'SP Bolted'!A418,IF($I$3=$M$5,'SP Welded'!A418,\"\")))","v":"HSS10X3-1/2X3/8"},{"$f":"IF($I$3=$M$3,'SP Plus Bolted'!B418,IF($I$3=$M$4,'SP Bolted'!B418,IF($I$3=$M$5,'SP Welded'!B418,\"\")))","v":11},{"$f":"IF($I$3=$M$3,'SP Plus Bolted'!C418,IF($I$3=$M$4,'SP Bolted'!C418,IF($I$3=$M$5,'SP Welded'!C418,\"\")))","v":13.5}]
[{"$f":"IF($I$3=$M$3,'SP Plus Bolted'!A419,IF($I$3=$M$4,'SP Bolted'!A419,IF($I$3=$M$5,'SP Welded'!A419,\"\")))","v":"HSS10X3-1/2X5/16"},{"$f":"IF($I$3=$M$3,'SP Plus Bolted'!B419,IF($I$3=$M$4,'SP Bolted'!B419,IF($I$3=$M$5,'SP Welded'!B419,\"\")))","v":11},{"$f":"IF($I$3=$M$3,'SP Plus Bolted'!C419,IF($I$3=$M$4,'SP Bolted'!C419,IF($I$3=$M$5,'SP Welded'!C419,\"\")))","v":13.5}]
[{"$f":"IF($I$3=$M$3,'SP Plus Bolted'!A420,IF($I$3=$M$4,'SP Bolted'!A420,IF($I$3=$M$5,'SP Welded'!A420,\"\")))","v":"HSS10X3-1/2X1/4"},{"$f":"IF($I$3=$M$3,'SP Plus Bolted'!B420,IF($I$3=$M$4,'SP Bolted'!B420,IF($I$3=$M$5,'SP Welded'!B420,\"\")))","v":11},{"$f":"IF($I$3=$M$3,'SP Plus Bolted'!C420,IF($I$3=$M$4,'SP Bolted'!C420,IF($I$3=$M$5,'SP Welded'!C420,\"\")))","v":13.5}]
[{"$f":"IF($I$3=$M$3,'SP Plus Bolted'!A421,IF($I$3=$M$4,'SP Bolted'!A421,IF($I$3=$M$5,'SP Welded'!A421,\"\")))","v":"HSS10X3-1/2X3/16"},{"$f":"IF($I$3=$M$3,'SP Plus Bolted'!B421,IF($I$3=$M$4,'SP Bolted'!B421,IF($I$3=$M$5,'SP Welded'!B421,\"\")))","v":11},{"$f":"IF($I$3=$M$3,'SP Plus Bolted'!C421,IF($I$3=$M$4,'SP Bolted'!C421,IF($I$3=$M$5,'SP Welded'!C421,\"\")))","v":13.5}]
[{"$f":"IF($I$3=$M$3,'SP Plus Bolted'!A422,IF($I$3=$M$4,'SP Bolted'!A422,IF($I$3=$M$5,'SP Welded'!A422,\"\")))","v":"HSS10X3-1/2X1/8"},{"$f":"IF($I$3=$M$3,'SP Plus Bolted'!B422,IF($I$3=$M$4,'SP Bolted'!B422,IF($I$3=$M$5,'SP Welded'!B422,\"\")))","v":11},{"$f":"IF($I$3=$M$3,'SP Plus Bolted'!C422,IF($I$3=$M$4,'SP Bolted'!C422,IF($I$3=$M$5,'SP Welded'!C422,\"\")))","v":13.5}]
[{"$f":"IF($I$3=$M$3,'SP Plus Bolted'!A423,IF($I$3=$M$4,'SP Bolted'!A423,IF($I$3=$M$5,'SP Welded'!A423,\"\")))","v":"HSS10X3X3/8"},{"$f":"IF($I$3=$M$3,'SP Plus Bolted'!B423,IF($I$3=$M$4,'SP Bolted'!B423,IF($I$3=$M$5,'SP Welded'!B423,\"\")))","v":11},{"$f":"IF($I$3=$M$3,'SP Plus Bolted'!C423,IF($I$3=$M$4,'SP Bolted'!C423,IF($I$3=$M$5,'SP Welded'!C423,\"\")))","v":13.5}]
[{"$f":"IF($I$3=$M$3,'SP Plus Bolted'!A424,IF($I$3=$M$4,'SP Bolted'!A424,IF($I$3=$M$5,'SP Welded'!A424,\"\")))","v":"HSS10X3X5/16"},{"$f":"IF($I$3=$M$3,'SP Plus Bolted'!B424,IF($I$3=$M$4,'SP Bolted'!B424,IF($I$3=$M$5,'SP Welded'!B424,\"\")))","v":11},{"$f":"IF($I$3=$M$3,'SP Plus Bolted'!C424,IF($I$3=$M$4,'SP Bolted'!C424,IF($I$3=$M$5,'SP Welded'!C424,\"\")))","v":13.5}]
[{"$f":"IF($I$3=$M$3,'SP Plus Bolted'!A425,IF($I$3=$M$4,'SP Bolted'!A425,IF($I$3=$M$5,'SP Welded'!A425,\"\")))","v":"HSS10X3X1/4"},{"$f":"IF($I$3=$M$3,'SP Plus Bolted'!B425,IF($I$3=$M$4,'SP Bolted'!B425,IF($I$3=$M$5,'SP Welded'!B425,\"\")))","v":11},{"$f":"IF($I$3=$M$3,'SP Plus Bolted'!C425,IF($I$3=$M$4,'SP Bolted'!C425,IF($I$3=$M$5,'SP Welded'!C425,\"\")))","v":13.5}]
[{"$f":"IF($I$3=$M$3,'SP Plus Bolted'!A426,IF($I$3=$M$4,'SP Bolted'!A426,IF($I$3=$M$5,'SP Welded'!A426,\"\")))","v":"HSS10X3X3/16"},{"$f":"IF($I$3=$M$3,'SP Plus Bolted'!B426,IF($I$3=$M$4,'SP Bolted'!B426,IF($I$3=$M$5,'SP Welded'!B426,\"\")))","v":11},{"$f":"IF($I$3=$M$3,'SP Plus Bolted'!C426,IF($I$3=$M$4,'SP Bolted'!C426,IF($I$3=$M$5,'SP Welded'!C426,\"\")))","v":13.5}]
[{"$f":"IF($I$3=$M$3,'SP Plus Bolted'!A427,IF($I$3=$M$4,'SP Bolted'!A427,IF($I$3=$M$5,'SP Welded'!A427,\"\")))","v":"HSS10X3X1/8"},{"$f":"IF($I$3=$M$3,'SP Plus Bolted'!B427,IF($I$3=$M$4,'SP Bolted'!B427,IF($I$3=$M$5,'SP Welded'!B427,\"\")))","v":11},{"$f":"IF($I$3=$M$3,'SP Plus Bolted'!C427,IF($I$3=$M$4,'SP Bolted'!C427,IF($I$3=$M$5,'SP Welded'!C427,\"\")))","v":13.5}]
[{"$f":"IF($I$3=$M$3,'SP Plus Bolted'!A428,IF($I$3=$M$4,'SP Bolted'!A428,IF($I$3=$M$5,'SP Welded'!A428,\"\")))","v":"HSS10X2X3/8"},{"$f":"IF($I$3=$M$3,'SP Plus Bolted'!B428,IF($I$3=$M$4,'SP Bolted'!B428,IF($I$3=$M$5,'SP Welded'!B428,\"\")))","v":11},{"$f":"IF($I$3=$M$3,'SP Plus Bolted'!C428,IF($I$3=$M$4,'SP Bolted'!C428,IF($I$3=$M$5,'SP Welded'!C428,\"\")))","v":13.5}]
[{"$f":"IF($I$3=$M$3,'SP Plus Bolted'!A429,IF($I$3=$M$4,'SP Bolted'!A429,IF($I$3=$M$5,'SP Welded'!A429,\"\")))","v":"HSS10X2X5/16"},{"$f":"IF($I$3=$M$3,'SP Plus Bolted'!B429,IF($I$3=$M$4,'SP Bolted'!B429,IF($I$3=$M$5,'SP Welded'!B429,\"\")))","v":11},{"$f":"IF($I$3=$M$3,'SP Plus Bolted'!C429,IF($I$3=$M$4,'SP Bolted'!C429,IF($I$3=$M$5,'SP Welded'!C429,\"\")))","v":13.5}]
[{"$f":"IF($I$3=$M$3,'SP Plus Bolted'!A430,IF($I$3=$M$4,'SP Bolted'!A430,IF($I$3=$M$5,'SP Welded'!A430,\"\")))","v":"HSS10X2X1/4"},{"$f":"IF($I$3=$M$3,'SP Plus Bolted'!B430,IF($I$3=$M$4,'SP Bolted'!B430,IF($I$3=$M$5,'SP Welded'!B430,\"\")))","v":11},{"$f":"IF($I$3=$M$3,'SP Plus Bolted'!C430,IF($I$3=$M$4,'SP Bolted'!C430,IF($I$3=$M$5,'SP Welded'!C430,\"\")))","v":13.5}]
[{"$f":"IF($I$3=$M$3,'SP Plus Bolted'!A431,IF($I$3=$M$4,'SP Bolted'!A431,IF($I$3=$M$5,'SP Welded'!A431,\"\")))","v":"HSS10X2X3/16"},{"$f":"IF($I$3=$M$3,'SP Plus Bolted'!B431,IF($I$3=$M$4,'SP Bolted'!B431,IF($I$3=$M$5,'SP Welded'!B431,\"\")))","v":11},{"$f":"IF($I$3=$M$3,'SP Plus Bolted'!C431,IF($I$3=$M$4,'SP Bolted'!C431,IF($I$3=$M$5,'SP Welded'!C431,\"\")))","v":13.5}]
[{"$f":"IF($I$3=$M$3,'SP Plus Bolted'!A432,IF($I$3=$M$4,'SP Bolted'!A432,IF($I$3=$M$5,'SP Welded'!A432,\"\")))","v":"HSS10X2X1/8"},{"$f":"IF($I$3=$M$3,'SP Plus Bolted'!B432,IF($I$3=$M$4,'SP Bolted'!B432,IF($I$3=$M$5,'SP Welded'!B432,\"\")))","v":11},{"$f":"IF($I$3=$M$3,'SP Plus Bolted'!C432,IF($I$3=$M$4,'SP Bolted'!C432,IF($I$3=$M$5,'SP Welded'!C432,\"\")))","v":13.5}]
[{"$f":"IF($I$3=$M$3,'SP Plus Bolted'!A433,IF($I$3=$M$4,'SP Bolted'!A433,IF($I$3=$M$5,'SP Welded'!A433,\"\")))","v":"HSS9X9X5/8"},{"$f":"IF($I$3=$M$3,'SP Plus Bolted'!B433,IF($I$3=$M$4,'SP Bolted'!B433,IF($I$3=$M$5,'SP Welded'!B433,\"\")))","v":11},{"$f":"IF($I$3=$M$3,'SP Plus Bolted'!C433,IF($I$3=$M$4,'SP Bolted'!C433,IF($I$3=$M$5,'SP Welded'!C433,\"\")))","v":12.5}]
[{"$f":"IF($I$3=$M$3,'SP Plus Bolted'!A434,IF($I$3=$M$4,'SP Bolted'!A434,IF($I$3=$M$5,'SP Welded'!A434,\"\")))","v":"HSS9X9X1/2"},{"$f":"IF($I$3=$M$3,'SP Plus Bolted'!B434,IF($I$3=$M$4,'SP Bolted'!B434,IF($I$3=$M$5,'SP Welded'!B434,\"\")))","v":11},{"$f":"IF($I$3=$M$3,'SP Plus Bolted'!C434,IF($I$3=$M$4,'SP Bolted'!C434,IF($I$3=$M$5,'SP Welded'!C434,\"\")))","v":12.5}]
[{"$f":"IF($I$3=$M$3,'SP Plus Bolted'!A435,IF($I$3=$M$4,'SP Bolted'!A435,IF($I$3=$M$5,'SP Welded'!A435,\"\")))","v":"HSS9X9X3/8"},{"$f":"IF($I$3=$M$3,'SP Plus Bolted'!B435,IF($I$3=$M$4,'SP Bolted'!B435,IF($I$3=$M$5,'SP Welded'!B435,\"\")))","v":11},{"$f":"IF($I$3=$M$3,'SP Plus Bolted'!C435,IF($I$3=$M$4,'SP Bolted'!C435,IF($I$3=$M$5,'SP Welded'!C435,\"\")))","v":12.5}]
[{"$f":"IF($I$3=$M$3,'SP Plus Bolted'!A436,IF($I$3=$M$4,'SP Bolted'!A436,IF($I$3=$M$5,'SP Welded'!A436,\"\")))","v":"HSS9X9X5/16"},{"$f":"IF($I$3=$M$3,'SP Plus Bolted'!B436,IF($I$3=$M$4,'SP Bolted'!B436,IF($I$3=$M$5,'SP Welded'!B436,\"\")))","v":11},{"$f":"IF($I$3=$M$3,'SP Plus Bolted'!C436,IF($I$3=$M$4,'SP Bolted'!C436,IF($I$3=$M$5,'SP Welded'!C436,\"\")))","v":12.5}]
[{"$f":"IF($I$3=$M$3,'SP Plus Bolted'!A437,IF($I$3=$M$4,'SP Bolted'!A437,IF($I$3=$M$5,'SP Welded'!A437,\"\")))","v":"HSS9X9X1/4"},{"$f":"IF($I$3=$M$3,'SP Plus Bolted'!B437,IF($I$3=$M$4,'SP Bolted'!B437,IF($I$3=$M$5,'SP Welded'!B437,\"\")))","v":11},{"$f":"IF($I$3=$M$3,'SP Plus Bolted'!C437,IF($I$3=$M$4,'SP Bolted'!C437,IF($I$3=$M$5,'SP Welded'!C437,\"\")))","v":12.5}]
[{"$f":"IF($I$3=$M$3,'SP Plus Bolted'!A438,IF($I$3=$M$4,'SP Bolted'!A438,IF($I$3=$M$5,'SP Welded'!A438,\"\")))","v":"HSS9X9X3/16"},{"$f":"IF($I$3=$M$3,'SP Plus Bolted'!B438,IF($I$3=$M$4,'SP Bolted'!B438,IF($I$3=$M$5,'SP Welded'!B438,\"\")))","v":11},{"$f":"IF($I$3=$M$3,'SP Plus Bolted'!C438,IF($I$3=$M$4,'SP Bolted'!C438,IF($I$3=$M$5,'SP Welded'!C438,\"\")))","v":12.5}]
[{"$f":"IF($I$3=$M$3,'SP Plus Bolted'!A439,IF($I$3=$M$4,'SP Bolted'!A439,IF($I$3=$M$5,'SP Welded'!A439,\"\")))","v":"HSS9X7X5/8"},{"$f":"IF($I$3=$M$3,'SP Plus Bolted'!B439,IF($I$3=$M$4,'SP Bolted'!B439,IF($I$3=$M$5,'SP Welded'!B439,\"\")))","v":11},{"$f":"IF($I$3=$M$3,'SP Plus Bolted'!C439,IF($I$3=$M$4,'SP Bolted'!C439,IF($I$3=$M$5,'SP Welded'!C439,\"\")))","v":12.5}]
[{"$f":"IF($I$3=$M$3,'SP Plus Bolted'!A440,IF($I$3=$M$4,'SP Bolted'!A440,IF($I$3=$M$5,'SP Welded'!A440,\"\")))","v":"HSS9X7X1/2"},{"$f":"IF($I$3=$M$3,'SP Plus Bolted'!B440,IF($I$3=$M$4,'SP Bolted'!B440,IF($I$3=$M$5,'SP Welded'!B440,\"\")))","v":11},{"$f":"IF($I$3=$M$3,'SP Plus Bolted'!C440,IF($I$3=$M$4,'SP Bolted'!C440,IF($I$3=$M$5,'SP Welded'!C440,\"\")))","v":12.5}]
[{"$f":"IF($I$3=$M$3,'SP Plus Bolted'!A441,IF($I$3=$M$4,'SP Bolted'!A441,IF($I$3=$M$5,'SP Welded'!A441,\"\")))","v":"HSS9X7X3/8"},{"$f":"IF($I$3=$M$3,'SP Plus Bolted'!B441,IF($I$3=$M$4,'SP Bolted'!B441,IF($I$3=$M$5,'SP Welded'!B441,\"\")))","v":11},{"$f":"IF($I$3=$M$3,'SP Plus Bolted'!C441,IF($I$3=$M$4,'SP Bolted'!C441,IF($I$3=$M$5,'SP Welded'!C441,\"\")))","v":12.5}]
[{"$f":"IF($I$3=$M$3,'SP Plus Bolted'!A442,IF($I$3=$M$4,'SP Bolted'!A442,IF($I$3=$M$5,'SP Welded'!A442,\"\")))","v":"HSS9X7X5/16"},{"$f":"IF($I$3=$M$3,'SP Plus Bolted'!B442,IF($I$3=$M$4,'SP Bolted'!B442,IF($I$3=$M$5,'SP Welded'!B442,\"\")))","v":11},{"$f":"IF($I$3=$M$3,'SP Plus Bolted'!C442,IF($I$3=$M$4,'SP Bolted'!C442,IF($I$3=$M$5,'SP Welded'!C442,\"\")))","v":12.5}]
[{"$f":"IF($I$3=$M$3,'SP Plus Bolted'!A443,IF($I$3=$M$4,'SP Bolted'!A443,IF($I$3=$M$5,'SP Welded'!A443,\"\")))","v":"HSS9X7X1/4"},{"$f":"IF($I$3=$M$3,'SP Plus Bolted'!B443,IF($I$3=$M$4,'SP Bolted'!B443,IF($I$3=$M$5,'SP Welded'!B443,\"\")))","v":11},{"$f":"IF($I$3=$M$3,'SP Plus Bolted'!C443,IF($I$3=$M$4,'SP Bolted'!C443,IF($I$3=$M$5,'SP Welded'!C443,\"\")))","v":12.5}]
[{"$f":"IF($I$3=$M$3,'SP Plus Bolted'!A444,IF($I$3=$M$4,'SP Bolted'!A444,IF($I$3=$M$5,'SP Welded'!A444,\"\")))","v":"HSS9X7X3/16"},{"$f":"IF($I$3=$M$3,'SP Plus Bolted'!B444,IF($I$3=$M$4,'SP Bolted'!B444,IF($I$3=$M$5,'SP Welded'!B444,\"\")))","v":11},{"$f":"IF($I$3=$M$3,'SP Plus Bolted'!C444,IF($I$3=$M$4,'SP Bolted'!C444,IF($I$3=$M$5,'SP Welded'!C444,\"\")))","v":12.5}]
[{"$f":"IF($I$3=$M$3,'SP Plus Bolted'!A445,IF($I$3=$M$4,'SP Bolted'!A445,IF($I$3=$M$5,'SP Welded'!A445,\"\")))","v":"HSS9X5X5/8"},{"$f":"IF($I$3=$M$3,'SP Plus Bolted'!B445,IF($I$3=$M$4,'SP Bolted'!B445,IF($I$3=$M$5,'SP Welded'!B445,\"\")))","v":11},{"$f":"IF($I$3=$M$3,'SP Plus Bolted'!C445,IF($I$3=$M$4,'SP Bolted'!C445,IF($I$3=$M$5,'SP Welded'!C445,\"\")))","v":12.5}]
[{"$f":"IF($I$3=$M$3,'SP Plus Bolted'!A446,IF($I$3=$M$4,'SP Bolted'!A446,IF($I$3=$M$5,'SP Welded'!A446,\"\")))","v":"HSS9X5X1/2"},{"$f":"IF($I$3=$M$3,'SP Plus Bolted'!B446,IF($I$3=$M$4,'SP Bolted'!B446,IF($I$3=$M$5,'SP Welded'!B446,\"\")))","v":11},{"$f":"IF($I$3=$M$3,'SP Plus Bolted'!C446,IF($I$3=$M$4,'SP Bolted'!C446,IF($I$3=$M$5,'SP Welded'!C446,\"\")))","v":12.5}]
[{"$f":"IF($I$3=$M$3,'SP Plus Bolted'!A447,IF($I$3=$M$4,'SP Bolted'!A447,IF($I$3=$M$5,'SP Welded'!A447,\"\")))","v":"HSS9X5X3/8"},{"$f":"IF($I$3=$M$3,'SP Plus Bolted'!B447,IF($I$3=$M$4,'SP Bolted'!B447,IF($I$3=$M$5,'SP Welded'!B447,\"\")))","v":11},{"$f":"IF($I$3=$M$3,'SP Plus Bolted'!C447,IF($I$3=$M$4,'SP Bolted'!C447,IF($I$3=$M$5,'SP Welded'!C447,\"\")))","v":12.5}]
[{"$f":"IF($I$3=$M$3,'SP Plus Bolted'!A448,IF($I$3=$M$4,'SP Bolted'!A448,IF($I$3=$M$5,'SP Welded'!A448,\"\")))","v":"HSS9X5X5/16"},{"$f":"IF($I$3=$M$3,'SP Plus Bolted'!B448,IF($I$3=$M$4,'SP Bolted'!B448,IF($I$3=$M$5,'SP Welded'!B448,\"\")))","v":11},{"$f":"IF($I$3=$M$3,'SP Plus Bolted'!C448,IF($I$3=$M$4,'SP Bolted'!C448,IF($I$3=$M$5,'SP Welded'!C448,\"\")))","v":12.5}]
[{"$f":"IF($I$3=$M$3,'SP Plus Bolted'!A449,IF($I$3=$M$4,'SP Bolted'!A449,IF($I$3=$M$5,'SP Welded'!A449,\"\")))","v":"HSS9X5X1/4"},{"$f":"IF($I$3=$M$3,'SP Plus Bolted'!B449,IF($I$3=$M$4,'SP Bolted'!B449,IF($I$3=$M$5,'SP Welded'!B449,\"\")))","v":11},{"$f":"IF($I$3=$M$3,'SP Plus Bolted'!C449,IF($I$3=$M$4,'SP Bolted'!C449,IF($I$3=$M$5,'SP Welded'!C449,\"\")))","v":12.5}]
[{"$f":"IF($I$3=$M$3,'SP Plus Bolted'!A450,IF($I$3=$M$4,'SP Bolted'!A450,IF($I$3=$M$5,'SP Welded'!A450,\"\")))","v":"HSS9X5X3/16"},{"$f":"IF($I$3=$M$3,'SP Plus Bolted'!B450,IF($I$3=$M$4,'SP Bolted'!B450,IF($I$3=$M$5,'SP Welded'!B450,\"\")))","v":11},{"$f":"IF($I$3=$M$3,'SP Plus Bolted'!C450,IF($I$3=$M$4,'SP Bolted'!C450,IF($I$3=$M$5,'SP Welded'!C450,\"\")))","v":12.5}]
[{"$f":"IF($I$3=$M$3,'SP Plus Bolted'!A451,IF($I$3=$M$4,'SP Bolted'!A451,IF($I$3=$M$5,'SP Welded'!A451,\"\")))","v":"HSS9X3X1/2"},{"$f":"IF($I$3=$M$3,'SP Plus Bolted'!B451,IF($I$3=$M$4,'SP Bolted'!B451,IF($I$3=$M$5,'SP Welded'!B451,\"\")))","v":11},{"$f":"IF($I$3=$M$3,'SP Plus Bolted'!C451,IF($I$3=$M$4,'SP Bolted'!C451,IF($I$3=$M$5,'SP Welded'!C451,\"\")))","v":12.5}]
[{"$f":"IF($I$3=$M$3,'SP Plus Bolted'!A452,IF($I$3=$M$4,'SP Bolted'!A452,IF($I$3=$M$5,'SP Welded'!A452,\"\")))","v":"HSS9X3X3/8"},{"$f":"IF($I$3=$M$3,'SP Plus Bolted'!B452,IF($I$3=$M$4,'SP Bolted'!B452,IF($I$3=$M$5,'SP Welded'!B452,\"\")))","v":11},{"$f":"IF($I$3=$M$3,'SP Plus Bolted'!C452,IF($I$3=$M$4,'SP Bolted'!C452,IF($I$3=$M$5,'SP Welded'!C452,\"\")))","v":12.5}]
[{"$f":"IF($I$3=$M$3,'SP Plus Bolted'!A453,IF($I$3=$M$4,'SP Bolted'!A453,IF($I$3=$M$5,'SP Welded'!A453,\"\")))","v":"HSS9X3X5/16"},{"$f":"IF($I$3=$M$3,'SP Plus Bolted'!B453,IF($I$3=$M$4,'SP Bolted'!B453,IF($I$3=$M$5,'SP Welded'!B453,\"\")))","v":11},{"$f":"IF($I$3=$M$3,'SP Plus Bolted'!C453,IF($I$3=$M$4,'SP Bolted'!C453,IF($I$3=$M$5,'SP Welded'!C453,\"\")))","v":12.5}]
[{"$f":"IF($I$3=$M$3,'SP Plus Bolted'!A454,IF($I$3=$M$4,'SP Bolted'!A454,IF($I$3=$M$5,'SP Welded'!A454,\"\")))","v":"HSS9X3X1/4"},{"$f":"IF($I$3=$M$3,'SP Plus Bolted'!B454,IF($I$3=$M$4,'SP Bolted'!B454,IF($I$3=$M$5,'SP Welded'!B454,\"\")))","v":11},{"$f":"IF($I$3=$M$3,'SP Plus Bolted'!C454,IF($I$3=$M$4,'SP Bolted'!C454,IF($I$3=$M$5,'SP Welded'!C454,\"\")))","v":12.5}]
[{"$f":"IF($I$3=$M$3,'SP Plus Bolted'!A455,IF($I$3=$M$4,'SP Bolted'!A455,IF($I$3=$M$5,'SP Welded'!A455,\"\")))","v":"HSS9X3X3/16"},{"$f":"IF($I$3=$M$3,'SP Plus Bolted'!B455,IF($I$3=$M$4,'SP Bolted'!B455,IF($I$3=$M$5,'SP Welded'!B455,\"\")))","v":11},{"$f":"IF($I$3=$M$3,'SP Plus Bolted'!C455,IF($I$3=$M$4,'SP Bolted'!C455,IF($I$3=$M$5,'SP Welded'!C455,\"\")))","v":12.5}]
[{"$f":"IF($I$3=$M$3,'SP Plus Bolted'!A456,IF($I$3=$M$4,'SP Bolted'!A456,IF($I$3=$M$5,'SP Welded'!A456,\"\")))","v":"HSS8X8X5/8"},{"$f":"IF($I$3=$M$3,'SP Plus Bolted'!B456,IF($I$3=$M$4,'SP Bolted'!B456,IF($I$3=$M$5,'SP Welded'!B456,\"\")))","v":11},{"$f":"IF($I$3=$M$3,'SP Plus Bolted'!C456,IF($I$3=$M$4,'SP Bolted'!C456,IF($I$3=$M$5,'SP Welded'!C456,\"\")))","v":11.5}]
[{"$f":"IF($I$3=$M$3,'SP Plus Bolted'!A457,IF($I$3=$M$4,'SP Bolted'!A457,IF($I$3=$M$5,'SP Welded'!A457,\"\")))","v":"HSS8X8X1/2"},{"$f":"IF($I$3=$M$3,'SP Plus Bolted'!B457,IF($I$3=$M$4,'SP Bolted'!B457,IF($I$3=$M$5,'SP Welded'!B457,\"\")))","v":11},{"$f":"IF($I$3=$M$3,'SP Plus Bolted'!C457,IF($I$3=$M$4,'SP Bolted'!C457,IF($I$3=$M$5,'SP Welded'!C457,\"\")))","v":11.5}]
[{"$f":"IF($I$3=$M$3,'SP Plus Bolted'!A458,IF($I$3=$M$4,'SP Bolted'!A458,IF($I$3=$M$5,'SP Welded'!A458,\"\")))","v":"HSS8X8X3/8"},{"$f":"IF($I$3=$M$3,'SP Plus Bolted'!B458,IF($I$3=$M$4,'SP Bolted'!B458,IF($I$3=$M$5,'SP Welded'!B458,\"\")))","v":11},{"$f":"IF($I$3=$M$3,'SP Plus Bolted'!C458,IF($I$3=$M$4,'SP Bolted'!C458,IF($I$3=$M$5,'SP Welded'!C458,\"\")))","v":11.5}]
[{"$f":"IF($I$3=$M$3,'SP Plus Bolted'!A459,IF($I$3=$M$4,'SP Bolted'!A459,IF($I$3=$M$5,'SP Welded'!A459,\"\")))","v":"HSS8X8X5/16"},{"$f":"IF($I$3=$M$3,'SP Plus Bolted'!B459,IF($I$3=$M$4,'SP Bolted'!B459,IF($I$3=$M$5,'SP Welded'!B459,\"\")))","v":11},{"$f":"IF($I$3=$M$3,'SP Plus Bolted'!C459,IF($I$3=$M$4,'SP Bolted'!C459,IF($I$3=$M$5,'SP Welded'!C459,\"\")))","v":11.5}]
[{"$f":"IF($I$3=$M$3,'SP Plus Bolted'!A460,IF($I$3=$M$4,'SP Bolted'!A460,IF($I$3=$M$5,'SP Welded'!A460,\"\")))","v":"HSS8X8X1/4"},{"$f":"IF($I$3=$M$3,'SP Plus Bolted'!B460,IF($I$3=$M$4,'SP Bolted'!B460,IF($I$3=$M$5,'SP Welded'!B460,\"\")))","v":11},{"$f":"IF($I$3=$M$3,'SP Plus Bolted'!C460,IF($I$3=$M$4,'SP Bolted'!C460,IF($I$3=$M$5,'SP Welded'!C460,\"\")))","v":11.5}]
[{"$f":"IF($I$3=$M$3,'SP Plus Bolted'!A461,IF($I$3=$M$4,'SP Bolted'!A461,IF($I$3=$M$5,'SP Welded'!A461,\"\")))","v":"HSS8X8X3/16"},{"$f":"IF($I$3=$M$3,'SP Plus Bolted'!B461,IF($I$3=$M$4,'SP Bolted'!B461,IF($I$3=$M$5,'SP Welded'!B461,\"\")))","v":11},{"$f":"IF($I$3=$M$3,'SP Plus Bolted'!C461,IF($I$3=$M$4,'SP Bolted'!C461,IF($I$3=$M$5,'SP Welded'!C461,\"\")))","v":11.5}]
[{"$f":"IF($I$3=$M$3,'SP Plus Bolted'!A462,IF($I$3=$M$4,'SP Bolted'!A462,IF($I$3=$M$5,'SP Welded'!A462,\"\")))","v":"HSS8X6X5/8"},{"$f":"IF($I$3=$M$3,'SP Plus Bolted'!B462,IF($I$3=$M$4,'SP Bolted'!B462,IF($I$3=$M$5,'SP Welded'!B462,\"\")))","v":11},{"$f":"IF($I$3=$M$3,'SP Plus Bolted'!C462,IF($I$3=$M$4,'SP Bolted'!C462,IF($I$3=$M$5,'SP Welded'!C462,\"\")))","v":11.5}]
[{"$f":"IF($I$3=$M$3,'SP Plus Bolted'!A463,IF($I$3=$M$4,'SP Bolted'!A463,IF($I$3=$M$5,'SP Welded'!A463,\"\")))","v":"HSS8X6X1/2"},{"$f":"IF($I$3=$M$3,'SP Plus Bolted'!B463,IF($I$3=$M$4,'SP Bolted'!B463,IF($I$3=$M$5,'SP Welded'!B463,\"\")))","v":11},{"$f":"IF($I$3=$M$3,'SP Plus Bolted'!C463,IF($I$3=$M$4,'SP Bolted'!C463,IF($I$3=$M$5,'SP Welded'!C463,\"\")))","v":11.5}]
[{"$f":"IF($I$3=$M$3,'SP Plus Bolted'!A464,IF($I$3=$M$4,'SP Bolted'!A464,IF($I$3=$M$5,'SP Welded'!A464,\"\")))","v":"HSS8X6X3/8"},{"$f":"IF($I$3=$M$3,'SP Plus Bolted'!B464,IF($I$3=$M$4,'SP Bolted'!B464,IF($I$3=$M$5,'SP Welded'!B464,\"\")))","v":11},{"$f":"IF($I$3=$M$3,'SP Plus Bolted'!C464,IF($I$3=$M$4,'SP Bolted'!C464,IF($I$3=$M$5,'SP Welded'!C464,\"\")))","v":11.5}]
[{"$f":"IF($I$3=$M$3,'SP Plus Bolted'!A465,IF($I$3=$M$4,'SP Bolted'!A465,IF($I$3=$M$5,'SP Welded'!A465,\"\")))","v":"HSS8X6X5/16"},{"$f":"IF($I$3=$M$3,'SP Plus Bolted'!B465,IF($I$3=$M$4,'SP Bolted'!B465,IF($I$3=$M$5,'SP Welded'!B465,\"\")))","v":11},{"$f":"IF($I$3=$M$3,'SP Plus Bolted'!C465,IF($I$3=$M$4,'SP Bolted'!C465,IF($I$3=$M$5,'SP Welded'!C465,\"\")))","v":11.5}]
[{"$f":"IF($I$3=$M$3,'SP Plus Bolted'!A466,IF($I$3=$M$4,'SP Bolted'!A466,IF($I$3=$M$5,'SP Welded'!A466,\"\")))","v":"HSS8X6X1/4"},{"$f":"IF($I$3=$M$3,'SP Plus Bolted'!B466,IF($I$3=$M$4,'SP Bolted'!B466,IF($I$3=$M$5,'SP Welded'!B466,\"\")))","v":11},{"$f":"IF($I$3=$M$3,'SP Plus Bolted'!C466,IF($I$3=$M$4,'SP Bolted'!C466,IF($I$3=$M$5,'SP Welded'!C466,\"\")))","v":11.5}]
[{"$f":"IF($I$3=$M$3,'SP Plus Bolted'!A467,IF($I$3=$M$4,'SP Bolted'!A467,IF($I$3=$M$5,'SP Welded'!A467,\"\")))","v":"HSS8X6X3/16"},{"$f":"IF($I$3=$M$3,'SP Plus Bolted'!B467,IF($I$3=$M$4,'SP Bolted'!B467,IF($I$3=$M$5,'SP Welded'!B467,\"\")))","v":11},{"$f":"IF($I$3=$M$3,'SP Plus Bolted'!C467,IF($I$3=$M$4,'SP Bolted'!C467,IF($I$3=$M$5,'SP Welded'!C467,\"\")))","v":11.5}]
[{"$f":"IF($I$3=$M$3,'SP Plus Bolted'!A468,IF($I$3=$M$4,'SP Bolted'!A468,IF($I$3=$M$5,'SP Welded'!A468,\"\")))","v":"HSS8X4X5/8"},{"$f":"IF($I$3=$M$3,'SP Plus Bolted'!B468,IF($I$3=$M$4,'SP Bolted'!B468,IF($I$3=$M$5,'SP Welded'!B468,\"\")))","v":11},{"$f":"IF($I$3=$M$3,'SP Plus Bolted'!C468,IF($I$3=$M$4,'SP Bolted'!C468,IF($I$3=$M$5,'SP Welded'!C468,\"\")))","v":11.5}]
[{"$f":"IF($I$3=$M$3,'SP Plus Bolted'!A469,IF($I$3=$M$4,'SP Bolted'!A469,IF($I$3=$M$5,'SP Welded'!A469,\"\")))","v":"HSS8X4X1/2"},{"$f":"IF($I$3=$M$3,'SP Plus Bolted'!B469,IF($I$3=$M$4,'SP Bolted'!B469,IF($I$3=$M$5,'SP Welded'!B469,\"\")))","v":11},{"$f":"IF($I$3=$M$3,'SP Plus Bolted'!C469,IF($I$3=$M$4,'SP Bolted'!C469,IF($I$3=$M$5,'SP Welded'!C469,\"\")))","v":11.5}]
[{"$f":"IF($I$3=$M$3,'SP Plus Bolted'!A470,IF($I$3=$M$4,'SP Bolted'!A470,IF($I$3=$M$5,'SP Welded'!A470,\"\")))","v":"HSS8X4X3/8"},{"$f":"IF($I$3=$M$3,'SP Plus Bolted'!B470,IF($I$3=$M$4,'SP Bolted'!B470,IF($I$3=$M$5,'SP Welded'!B470,\"\")))","v":11},{"$f":"IF($I$3=$M$3,'SP Plus Bolted'!C470,IF($I$3=$M$4,'SP Bolted'!C470,IF($I$3=$M$5,'SP Welded'!C470,\"\")))","v":11.5}]
[{"$f":"IF($I$3=$M$3,'SP Plus Bolted'!A471,IF($I$3=$M$4,'SP Bolted'!A471,IF($I$3=$M$5,'SP Welded'!A471,\"\")))","v":"HSS8X4X5/16"},{"$f":"IF($I$3=$M$3,'SP Plus Bolted'!B471,IF($I$3=$M$4,'SP Bolted'!B471,IF($I$3=$M$5,'SP Welded'!B471,\"\")))","v":11},{"$f":"IF($I$3=$M$3,'SP Plus Bolted'!C471,IF($I$3=$M$4,'SP Bolted'!C471,IF($I$3=$M$5,'SP Welded'!C471,\"\")))","v":11.5}]
[{"$f":"IF($I$3=$M$3,'SP Plus Bolted'!A472,IF($I$3=$M$4,'SP Bolted'!A472,IF($I$3=$M$5,'SP Welded'!A472,\"\")))","v":"HSS8X4X1/4"},{"$f":"IF($I$3=$M$3,'SP Plus Bolted'!B472,IF($I$3=$M$4,'SP Bolted'!B472,IF($I$3=$M$5,'SP Welded'!B472,\"\")))","v":11},{"$f":"IF($I$3=$M$3,'SP Plus Bolted'!C472,IF($I$3=$M$4,'SP Bolted'!C472,IF($I$3=$M$5,'SP Welded'!C472,\"\")))","v":11.5}]
[{"$f":"IF($I$3=$M$3,'SP Plus Bolted'!A473,IF($I$3=$M$4,'SP Bolted'!A473,IF($I$3=$M$5,'SP Welded'!A473,\"\")))","v":"HSS8X4X3/16"},{"$f":"IF($I$3=$M$3,'SP Plus Bolted'!B473,IF($I$3=$M$4,'SP Bolted'!B473,IF($I$3=$M$5,'SP Welded'!B473,\"\")))","v":11},{"$f":"IF($I$3=$M$3,'SP Plus Bolted'!C473,IF($I$3=$M$4,'SP Bolted'!C473,IF($I$3=$M$5,'SP Welded'!C473,\"\")))","v":11.5}]
[{"$f":"IF($I$3=$M$3,'SP Plus Bolted'!A474,IF($I$3=$M$4,'SP Bolted'!A474,IF($I$3=$M$5,'SP Welded'!A474,\"\")))","v":"HSS8X4X1/8"},{"$f":"IF($I$3=$M$3,'SP Plus Bolted'!B474,IF($I$3=$M$4,'SP Bolted'!B474,IF($I$3=$M$5,'SP Welded'!B474,\"\")))","v":11},{"$f":"IF($I$3=$M$3,'SP Plus Bolted'!C474,IF($I$3=$M$4,'SP Bolted'!C474,IF($I$3=$M$5,'SP Welded'!C474,\"\")))","v":11.5}]
[{"$f":"IF($I$3=$M$3,'SP Plus Bolted'!A475,IF($I$3=$M$4,'SP Bolted'!A475,IF($I$3=$M$5,'SP Welded'!A475,\"\")))","v":"HSS8X3X1/2"},{"$f":"IF($I$3=$M$3,'SP Plus Bolted'!B475,IF($I$3=$M$4,'SP Bolted'!B475,IF($I$3=$M$5,'SP Welded'!B475,\"\")))","v":11},{"$f":"IF($I$3=$M$3,'SP Plus Bolted'!C475,IF($I$3=$M$4,'SP Bolted'!C475,IF($I$3=$M$5,'SP Welded'!C475,\"\")))","v":11.5}]
[{"$f":"IF($I$3=$M$3,'SP Plus Bolted'!A476,IF($I$3=$M$4,'SP Bolted'!A476,IF($I$3=$M$5,'SP Welded'!A476,\"\")))","v":"HSS8X3X3/8"},{"$f":"IF($I$3=$M$3,'SP Plus Bolted'!B476,IF($I$3=$M$4,'SP Bolted'!B476,IF($I$3=$M$5,'SP Welded'!B476,\"\")))","v":11},{"$f":"IF($I$3=$M$3,'SP Plus Bolted'!C476,IF($I$3=$M$4,'SP Bolted'!C476,IF($I$3=$M$5,'SP Welded'!C476,\"\")))","v":11.5}]
[{"$f":"IF($I$3=$M$3,'SP Plus Bolted'!A477,IF($I$3=$M$4,'SP Bolted'!A477,IF($I$3=$M$5,'SP Welded'!A477,\"\")))","v":"HSS8X3X5/16"},{"$f":"IF($I$3=$M$3,'SP Plus Bolted'!B477,IF($I$3=$M$4,'SP Bolted'!B477,IF($I$3=$M$5,'SP Welded'!B477,\"\")))","v":11},{"$f":"IF($I$3=$M$3,'SP Plus Bolted'!C477,IF($I$3=$M$4,'SP Bolted'!C477,IF($I$3=$M$5,'SP Welded'!C477,\"\")))","v":11.5}]
[{"$f":"IF($I$3=$M$3,'SP Plus Bolted'!A478,IF($I$3=$M$4,'SP Bolted'!A478,IF($I$3=$M$5,'SP Welded'!A478,\"\")))","v":"HSS8X3X1/4"},{"$f":"IF($I$3=$M$3,'SP Plus Bolted'!B478,IF($I$3=$M$4,'SP Bolted'!B478,IF($I$3=$M$5,'SP Welded'!B478,\"\")))","v":11},{"$f":"IF($I$3=$M$3,'SP Plus Bolted'!C478,IF($I$3=$M$4,'SP Bolted'!C478,IF($I$3=$M$5,'SP Welded'!C478,\"\")))","v":11.5}]
[{"$f":"IF($I$3=$M$3,'SP Plus Bolted'!A479,IF($I$3=$M$4,'SP Bolted'!A479,IF($I$3=$M$5,'SP Welded'!A479,\"\")))","v":"HSS8X3X3/16"},{"$f":"IF($I$3=$M$3,'SP Plus Bolted'!B479,IF($I$3=$M$4,'SP Bolted'!B479,IF($I$3=$M$5,'SP Welded'!B479,\"\")))","v":11},{"$f":"IF($I$3=$M$3,'SP Plus Bolted'!C479,IF($I$3=$M$4,'SP Bolted'!C479,IF($I$3=$M$5,'SP Welded'!C479,\"\")))","v":11.5}]
[{"$f":"IF($I$3=$M$3,'SP Plus Bolted'!A480,IF($I$3=$M$4,'SP Bolted'!A480,IF($I$3=$M$5,'SP Welded'!A480,\"\")))","v":"HSS8X3X1/8"},{"$f":"IF($I$3=$M$3,'SP Plus Bolted'!B480,IF($I$3=$M$4,'SP Bolted'!B480,IF($I$3=$M$5,'SP Welded'!B480,\"\")))","v":11},{"$f":"IF($I$3=$M$3,'SP Plus Bolted'!C480,IF($I$3=$M$4,'SP Bolted'!C480,IF($I$3=$M$5,'SP Welded'!C480,\"\")))","v":11.5}]
[{"$f":"IF($I$3=$M$3,'SP Plus Bolted'!A481,IF($I$3=$M$4,'SP Bolted'!A481,IF($I$3=$M$5,'SP Welded'!A481,\"\")))","v":"HSS8X2X3/8"},{"$f":"IF($I$3=$M$3,'SP Plus Bolted'!B481,IF($I$3=$M$4,'SP Bolted'!B481,IF($I$3=$M$5,'SP Welded'!B481,\"\")))","v":11},{"$f":"IF($I$3=$M$3,'SP Plus Bolted'!C481,IF($I$3=$M$4,'SP Bolted'!C481,IF($I$3=$M$5,'SP Welded'!C481,\"\")))","v":11.5}]
[{"$f":"IF($I$3=$M$3,'SP Plus Bolted'!A482,IF($I$3=$M$4,'SP Bolted'!A482,IF($I$3=$M$5,'SP Welded'!A482,\"\")))","v":"HSS8X2X5/16"},{"$f":"IF($I$3=$M$3,'SP Plus Bolted'!B482,IF($I$3=$M$4,'SP Bolted'!B482,IF($I$3=$M$5,'SP Welded'!B482,\"\")))","v":11},{"$f":"IF($I$3=$M$3,'SP Plus Bolted'!C482,IF($I$3=$M$4,'SP Bolted'!C482,IF($I$3=$M$5,'SP Welded'!C482,\"\")))","v":11.5}]
[{"$f":"IF($I$3=$M$3,'SP Plus Bolted'!A483,IF($I$3=$M$4,'SP Bolted'!A483,IF($I$3=$M$5,'SP Welded'!A483,\"\")))","v":"HSS8X2X1/4"},{"$f":"IF($I$3=$M$3,'SP Plus Bolted'!B483,IF($I$3=$M$4,'SP Bolted'!B483,IF($I$3=$M$5,'SP Welded'!B483,\"\")))","v":11},{"$f":"IF($I$3=$M$3,'SP Plus Bolted'!C483,IF($I$3=$M$4,'SP Bolted'!C483,IF($I$3=$M$5,'SP Welded'!C483,\"\")))","v":11.5}]
[{"$f":"IF($I$3=$M$3,'SP Plus Bolted'!A484,IF($I$3=$M$4,'SP Bolted'!A484,IF($I$3=$M$5,'SP Welded'!A484,\"\")))","v":"HSS8X2X3/16"},{"$f":"IF($I$3=$M$3,'SP Plus Bolted'!B484,IF($I$3=$M$4,'SP Bolted'!B484,IF($I$3=$M$5,'SP Welded'!B484,\"\")))","v":11},{"$f":"IF($I$3=$M$3,'SP Plus Bolted'!C484,IF($I$3=$M$4,'SP Bolted'!C484,IF($I$3=$M$5,'SP Welded'!C484,\"\")))","v":11.5}]
[{"$f":"IF($I$3=$M$3,'SP Plus Bolted'!A485,IF($I$3=$M$4,'SP Bolted'!A485,IF($I$3=$M$5,'SP Welded'!A485,\"\")))","v":"HSS8X2X1/8"},{"$f":"IF($I$3=$M$3,'SP Plus Bolted'!B485,IF($I$3=$M$4,'SP Bolted'!B485,IF($I$3=$M$5,'SP Welded'!B485,\"\")))","v":11},{"$f":"IF($I$3=$M$3,'SP Plus Bolted'!C485,IF($I$3=$M$4,'SP Bolted'!C485,IF($I$3=$M$5,'SP Welded'!C485,\"\")))","v":11.5}]

{"sheet":"Multipliers","index":5,"n_rows":24,"n_cols":14,"rows_kept":24,"cut":false,"hidden":true,"merged":[[19,2,19,4]]}
[]
[]
[]
[null,"OLD, 9/28/2019 - RW"]
[]
[null,"Multiplication factor for NPSP beams"]
[null,null,"Area","Shear A2","Shear A3","Ixx","Iyy","Sxx","Syy","rx","ry","Zx","Zy","Tor."]
[null,"Capacity (Non-OSHPD)",3,3,3,3,3,3,3,3,3,3,3,1]
[null,"Capacity (OSHPD)",1,1,1,3,1,"see below",1,1,1,"see below",1,1]
[null,"R=3",1,1,1,1,1,3,3,1,1,3,3,1]
[null,"Multiplication factor for NPSP beams"]
[null,null,"Area","Shear A2","Shear A3","Ixx","Iyy","Sxx","Syy","rx","ry","Zx","Zy","Tor."]
[null,"Capacity (Non-OSHPD)",3,3,3,3,3,3,3,3,3,3,3,1]
[null,"Capacity (OSHPD)",1,1,1,3,1,"2*(3*Ixx)/DimB",1,1,1,"1.15*Sxx",1,1]
[null,"R=3",1,1,1,1,1,3,3,1,1,3,3,1]
[]
[]
[null,"New, 9/28/2019"]
[]
[null,null,"Multipliers"]
[null,null,"Ix","Sx","Zx"]
[null,"SidePlate Plus Bolted",3,2.5,2.5]
[null,"SidePlate Bolted",3,2.5,2.5]
[null,"SidePlate Welded",3,2.5,2.5]

{"sheet":"SP Plus Bolted","index":6,"n_rows":485,"n_cols":3,"rows_kept":485,"cut":false,"hidden":true,"merged":[]}
["Shape","SP Length (in)","SP Depth (in)"]
["W44X335",38,47.5]
["W44X290",38,47.5]
["W44X262",37,47]
["W44X230",37,46.5]
["W40X655",38,47.5]
["W40X593",37,46.5]
["W40X503",36,45.5]
["W40X431",36,45]
["W40X397",35,44.5]
["W40X372",35,44.5]
["W40X362",35,44]
["W40X324",35,44]
["W40X297",34,43.5]
["W40X277",34,43.5]
["W40X249",34,43]
["W40X215",34,42.5]
["W40X199",33,42.5]
["W40X392",36,45.5]
["W40X331",35,44.5]
["W40X327",35,44.5]
["W40X294",35,44]
["W40X278",35,44]
["W40X264",34,43.5]
["W40X235",34,43.5]
["W40X211",34,43]
["W40X183",34,42.5]
["W40X167",33,42.5]
["W40X149",33,42]
["W36X925",37,47]
["W36X853",37,47]
["W36X802",37,46.5]
["W36X723",36,45.5]
["W36X652",35,44.5]
["W36X529",34,43.5]
["W36X487",34,43]
["W36X441",34,42.5]
["W36X395",33,42]
["W36X361",33,41.5]
["W36X330",32,41.5]
["W36X302",32,41]
["W36X282",32,41]
["W36X262",32,40.5]
["W36X247",32,40.5]
["W36X231",32,40]
["W36X256",32,41]
["W36X232",32,41]
["W36X210",32,40.5]
["W36X194",32,40]
["W36X182",31,40]
["W36X170",31,40]
["W36X160",31,39.5]
["W36X150",31,39.5]
["W36X135",31,39]
["W33X387",31,39.5]
["W33X354",31,39]
["W33X318",30,39]
["W33X291",30,38.5]
["W33X263",30,38]
["W33X241",30,38]
["W33X221",29,37.5]
["W33X201",29,37.5]
["W33X169",29,37.5]
["W33X152",29,37]
["W33X141",29,37]
["W33X130",29,37]
["W33X118",28,36.5]
["W30X391",29,37]
["W30X357",28,36.5]
["W30X326",28,36]
["W30X292",28,35.5]
["W30X261",27,35.5]
["W30X235",27,35]
["W30X211",27,34.5]
["W30X191",27,34.5]
["W30X173",26,34]
["W30X148",27,34.5]
["W30X132",26,34]
["W30X124",26,34]
["W30X116",26,33.5]
["W30X108",26,33.5]
["W30X99",26,33.5]
["W30X90",26,33]
["W27X539",28,36]
["W27X368",26,34]
["W27X336",26,33.5]
["W27X307",26,33.5]
["W27X281",25,33]
["W27X258",25,32.5]
["W27X235",25,32.5]
["W27X217",25,32]
["W27X194",24,32]
["W27X178",24,31.5]
["W27X161",24,31.5]
["W27X146",24,31]
["W27X129",24,31.5]
["W27X114",24,31]
["W27X102",24,31]
["W27X94",23,30.5]
["W27X84",23,30.5]
["W24X370",24,31.5]
["W24X335",24,31]
["W24X306",24,31]
["W24X279",23,30.5]
["W24X250",23,30]
["W24X229",23,29.5]
["W24X207",22,29.5]
["W24X192",22,29]
["W24X176",22,29]
["W24X162",22,28.5]
["W24X146",22,28.5]
["W24X131",21,28]
["W24X117",21,28]
["W24X104",21,27.5]
["W24X103",21,28]
["W24X94",21,28]
["W24X84",21,28]
["W24X76",21,27.5]
["W24X68",21,27.5]
["W24X62",21,27.5]
["W24X55",21,27.5]
["W21X275",21,28]
["W21X248",21,27.5]
["W21X223",20,27]
["W21X201",20,26.5]
["W21X182",20,26.5]
["W21X166",20,26]
["W21X147",19,25.5]
["W21X132",19,25.5]
["W21X122",19,25.5]
["W21X111",19,25]
["W21X101",19,25]
["W21X93",19,25.5]
["W21X83",19,25]
["W21X73",19,25]
["W21X68",18,25]
["W21X62",18,24.5]
["W21X55",18,24.5]
["W21X48",18,24.5]
["W21X57",18,24.5]
["W21X50",18,24.5]
["W21X44",18,24.5]
["W18X311",20,26]
["W18X283",19,25.5]
["W18X258",19,25]
["W18X234",18,24.5]
["W18X211",18,24.5]
["W18X192",18,24]
["W18X175",17,23.5]
["W18X158",17,23.5]
["W18X143",17,23]
["W18X130",17,23]
["W18X119",17,22.5]
["W18X106",16,22.5]
["W18X97",16,22.5]
["W18X86",16,22]
["W18X76",16,22]
["W18X71",16,22]
["W18X65",16,22]
["W18X60",16,22]
["W18X55",16,22]
["W18X50",16,21.5]
["W18X46",16,21.5]
["W18X40",16,21.5]
["W18X35",16,21.5]
["W16X100",15,20.5]
["W16X89",15,20.5]
["W16X77",15,20]
["W16X67",14,20]
["W16X57",14,20]
["W16X50",14,20]
["W16X45",14,20]
["W16X40",14,19.5]
["W16X36",14,19.5]
["W16X31",14,19.5]
["W16X26",14,19.5]
["W14X873",21,27.5]
["W14X808",20,26.5]
["W14X730",20,26]
["W14X665",19,25.5]
["W14X605",18,24.5]
["W14X550",18,24]
["W14X500",17,23.5]
["W14X455",17,22.5]
["W14X426",16,22.5]
["W14X398",16,22]
["W14X370",16,21.5]
["W14X342",15,21]
["W14X311",15,21]
["W14X283",15,20.5]
["W14X257",14,20]
["W14X233",14,19.5]
["W14X211",14,19.5]
["W14X193",14,19]
["W14X176",13,19]
["W14X159",13,18.5]
["W14X145",13,18.5]
["W14X132",13,18.5]
["W14X120",13,18]
["W14X109",13,18]
["W14X99",13,18]
["W14X90",12,17.5]
["W14X82",13,18]
["W14X74",13,18]
["W14X68",12,17.5]
["W14X61",12,17.5]
["W14X53",12,17.5]
["W14X48",12,17.5]
["W14X43",12,17.5]
["W14X38",13,18]
["W14X34",12,17.5]
["W14X30",12,17.5]
["W14X26",12,17.5]
["W14X22",12,17.5]
["W12X336",15,20.5]
["W12X305",14,20]
["W12X279",14,19.5]
["W12X252",14,19]
["W12X230",13,18.5]
["W12X210",13,18.5]
["W12X190",13,18]
["W12X170",12,17.5]
["W12X152",12,17.5]
["W12X136",12,17]
["W12X120",12,17]
["W12X106",11,16.5]
["W12X96",11,16.5]
["W12X87",11,16]
["W12X79",11,16]
["W12X72",11,16]
["W12X65",11,16]
["W12X58",11,16]
["W12X53",11,15.5]
["W12X50",11,16]
["W12X45",11,15.5]
["W12X40",11,15.5]
["W12X35",11,16]
["W12X30",11,16]
["W12X26",11,16]
["W12X22",11,16]
["W12X19",11,16]
["W12X16",11,15.5]
["W12X14",11,15.5]
["W10X112",11,15]
["W10X100",11,15]
["W10X88",11,14.5]
["W10X77",11,14.5]
["W10X68",11,14]
["W10X60",11,14]
["W10X54",11,14]
["W10X49",11,13.5]
["W10X45",11,14]
["W10X39",11,13.5]
["W10X33",11,13.5]
["W10X30",11,14]
["W10X26",11,14]
["W10X22",11,14]
["W10X19",11,14]
["W10X17",11,14]
["W10X15",11,13.5]
["W10X12",11,13.5]
["W8X67",11,12.5]
["W8X58",11,12.5]
["W8X48",11,12]
["W8X40",11,12]
["W8X35",11,12]
["W8X31",11,11.5]
["W8X28",11,11.5]
["W8X24",11,11.5]
["W8X21",11,12]
["W8X18",11,12]
["W8X15",11,12]
["W8X13",11,11.5]
["W8X10",11,12]
["HSS24X12X3/4",21,27.5]
["HSS24X12X5/8",21,27.5]
["HSS24X12X1/2",21,27.5]
["HSS22X22X7/8",19,25.5]
["HSS22X22X3/4",19,25.5]
["HSS20X20X7/8",17,23.5]
["HSS20X20X3/4",17,23.5]
["HSS20X20X5/8",17,23.5]
["HSS20X20X1/2",17,23.5]
["HSS20X12X3/4",17,23.5]
["HSS20X12X5/8",17,23.5]
["HSS20X12X1/2",17,23.5]
["HSS20X12X3/8",17,23.5]
["HSS20X12X5/16",17,23.5]
["HSS20X8X5/8",17,23.5]
["HSS20X8X1/2",17,23.5]
["HSS20X8X3/8",17,23.5]
["HSS20X8X5/16",17,23.5]
["HSS20X4X1/2",17,23.5]
["HSS20X4X3/8",17,23.5]
["HSS20X4X5/16",17,23.5]
["HSS20X4X1/4",17,23.5]
["HSS18X18X7/8",16,21.5]
["HSS18X18X3/4",16,21.5]
["HSS18X18X5/8",16,21.5]
["HSS18X18X1/2",16,21.5]
["HSS18X6X5/8",16,21.5]
["HSS18X6X1/2",16,21.5]
["HSS18X6X3/8",16,21.5]
["HSS18X6X5/16",16,21.5]
["HSS18X6X1/4",16,21.5]
["HSS16X16X7/8",14,19.5]
["HSS16X16X3/4",14,19.5]
["HSS16X16X5/8",14,19.5]
["HSS16X16X1/2",14,19.5]
["HSS16X16X3/8",14,19.5]
["HSS16X16X5/16",14,19.5]
["HSS16X12X3/4",14,19.5]
["HSS16X12X5/8",14,19.5]
["HSS16X12X1/2",14,19.5]
["HSS16X12X3/8",14,19.5]
["HSS16X12X5/16",14,19.5]
["HSS16X8X5/8",14,19.5]
["HSS16X8X1/2",14,19.5]
["HSS16X8X3/8",14,19.5]
["HSS16X8X5/16",14,19.5]
["HSS16X8X1/4",14,19.5]
["HSS16X4X5/8",14,19.5]
["HSS16X4X1/2",14,19.5]
["HSS16X4X3/8",14,19.5]
["HSS16X4X5/16",14,19.5]
["HSS16X4X1/4",14,19.5]
["HSS16X4X3/16",14,19.5]
["HSS14X14X7/8",12,17.5]
["HSS14X14X3/4",12,17.5]
["HSS14X14X5/8",12,17.5]
["HSS14X14X1/2",12,17.5]
["HSS14X14X3/8",12,17.5]
["HSS14X14X5/16",12,17.5]
["HSS14X10X5/8",12,17.5]
["HSS14X10X1/2",12,17.5]
["HSS14X10X3/8",12,17.5]
["HSS14X10X5/16",12,17.5]
["HSS14X10X1/4",12,17.5]
["HSS14X6X5/8",12,17.5]
["HSS14X6X1/2",12,17.5]
["HSS14X6X3/8",12,17.5]
["HSS14X6X5/16",12,17.5]
["HSS14X6X1/4",12,17.5]
["HSS14X6X3/16",12,17.5]
["HSS14X4X5/8",12,17.5]
["HSS14X4X1/2",12,17.5]
["HSS14X4X3/8",12,17.5]
["HSS14X4X5/16",12,17.5]
["HSS14X4X1/4",12,17.5]
["HSS14X4X3/16",12,17.5]
["HSS12X12X3/4",11,15.5]
["HSS12X12X5/8",11,15.5]
["HSS12X12X1/2",11,15.5]
["HSS12X12X3/8",11,15.5]
["HSS12X12X5/16",11,15.5]
["HSS12X12X1/4",11,15.5]
["HSS12X10X1/2",11,15.5]
["HSS12X10X3/8",11,15.5]
["HSS12X10X5/16",11,15.5]
["HSS12X10X1/4",11,15.5]
["HSS12X8X5/8",11,15.5]
["HSS12X8X1/2",11,15.5]
["HSS12X8X3/8",11,15.5]
["HSS12X8X5/16",11,15.5]
["HSS12X8X1/4",11,15.5]
["HSS12X8X3/16",11,15.5]
["HSS12X6X5/8",11,15.5]
["HSS12X6X1/2",11,15.5]
["HSS12X6X3/8",11,15.5]
["HSS12X6X5/16",11,15.5]
["HSS12X6X1/4",11,15.5]
["HSS12X6X3/16",11,15.5]
["HSS12X4X5/8",11,15.5]
["HSS12X4X1/2",11,15.5]
["HSS12X4X3/8",11,15.5]
["HSS12X4X5/16",11,15.5]
["HSS12X4X1/4",11,15.5]
["HSS12X4X3/16",11,15.5]
["HSS12X3-1/2X3/8",11,15.5]
["HSS12X3-1/2X5/16",11,15.5]
["HSS12X3X5/16",11,15.5]
["HSS12X3X1/4",11,15.5]
["HSS12X3X3/16",11,15.5]
["HSS12X2X5/16",11,15.5]
["HSS12X2X1/4",11,15.5]
["HSS12X2X3/16",11,15.5]
["HSS10X10X3/4",11,13.5]
["HSS10X10X5/8",11,13.5]
["HSS10X10X1/2",11,13.5]
["HSS10X10X3/8",11,13.5]
["HSS10X10X5/16",11,13.5]
["HSS10X10X1/4",11,13.5]
["HSS10X10X3/16",11,13.5]
["HSS10X8X5/8",11,13.5]
["HSS10X8X1/2",11,13.5]
["HSS10X8X3/8",11,13.5]
["HSS10X8X5/16",11,13.5]
["HSS10X8X1/4",11,13.5]
["HSS10X8X3/16",11,13.5]
["HSS10X6X5/8",11,13.5]
["HSS10X6X1/2",11,13.5]
["HSS10X6X3/8",11,13.5]
["HSS10X6X5/16",11,13.5]
["HSS10X6X1/4",11,13.5]
["HSS10X6X3/16",11,13.5]
["HSS10X5X3/8",11,13.5]
["HSS10X5X5/16",11,13.5]
["HSS10X5X1/4",11,13.5]
["HSS10X5X3/16",11,13.5]
["HSS10X4X5/8",11,13.5]
["HSS10X4X1/2",11,13.5]
["HSS10X4X3/8",11,13.5]
["HSS10X4X5/16",11,13.5]
["HSS10X4X1/4",11,13.5]
["HSS10X4X3/16",11,13.5]
["HSS10X4X1/8",11,13.5]
["HSS10X3-1/2X1/2",11,13.5]
["HSS10X3-1/2X3/8",11,13.5]
["HSS10X3-1/2X5/16",11,13.5]
["HSS10X3-1/2X1/4",11,13.5]
["HSS10X3-1/2X3/16",11,13.5]
["HSS10X3-1/2X1/8",11,13.5]
["HSS10X3X3/8",11,13.5]
["HSS10X3X5/16",11,13.5]
["HSS10X3X1/4",11,13.5]
["HSS10X3X3/16",11,13.5]
["HSS10X3X1/8",11,13.5]
["HSS10X2X3/8",11,13.5]
["HSS10X2X5/16",11,13.5]
["HSS10X2X1/4",11,13.5]
["HSS10X2X3/16",11,13.5]
["HSS10X2X1/8",11,13.5]
["HSS9X9X5/8",11,12.5]
["HSS9X9X1/2",11,12.5]
["HSS9X9X3/8",11,12.5]
["HSS9X9X5/16",11,12.5]
["HSS9X9X1/4",11,12.5]
["HSS9X9X3/16",11,12.5]
["HSS9X7X5/8",11,12.5]
["HSS9X7X1/2",11,12.5]
["HSS9X7X3/8",11,12.5]
["HSS9X7X5/16",11,12.5]
["HSS9X7X1/4",11,12.5]
["HSS9X7X3/16",11,12.5]
["HSS9X5X5/8",11,12.5]
["HSS9X5X1/2",11,12.5]
["HSS9X5X3/8",11,12.5]
["HSS9X5X5/16",11,12.5]
["HSS9X5X1/4",11,12.5]
["HSS9X5X3/16",11,12.5]
["HSS9X3X1/2",11,12.5]
["HSS9X3X3/8",11,12.5]
["HSS9X3X5/16",11,12.5]
["HSS9X3X1/4",11,12.5]
["HSS9X3X3/16",11,12.5]
["HSS8X8X5/8",11,11.5]
["HSS8X8X1/2",11,11.5]
["HSS8X8X3/8",11,11.5]
["HSS8X8X5/16",11,11.5]
["HSS8X8X1/4",11,11.5]
["HSS8X8X3/16",11,11.5]
["HSS8X6X5/8",11,11.5]
["HSS8X6X1/2",11,11.5]
["HSS8X6X3/8",11,11.5]
["HSS8X6X5/16",11,11.5]
["HSS8X6X1/4",11,11.5]
["HSS8X6X3/16",11,11.5]
["HSS8X4X5/8",11,11.5]
["HSS8X4X1/2",11,11.5]
["HSS8X4X3/8",11,11.5]
["HSS8X4X5/16",11,11.5]
["HSS8X4X1/4",11,11.5]
["HSS8X4X3/16",11,11.5]
["HSS8X4X1/8",11,11.5]
["HSS8X3X1/2",11,11.5]
["HSS8X3X3/8",11,11.5]
["HSS8X3X5/16",11,11.5]
["HSS8X3X1/4",11,11.5]
["HSS8X3X3/16",11,11.5]
["HSS8X3X1/8",11,11.5]
["HSS8X2X3/8",11,11.5]
["HSS8X2X5/16",11,11.5]
["HSS8X2X1/4",11,11.5]
["HSS8X2X3/16",11,11.5]
["HSS8X2X1/8",11,11.5]

{"sheet":"SP Bolted","index":7,"n_rows":485,"n_cols":3,"rows_kept":485,"cut":false,"hidden":true,"merged":[]}
["Shape","SP Length (in)","SP Depth (in)"]
["W44X335",29,47.5]
["W44X290",29,47.5]
["W44X262",29,47]
["W44X230",28,46.5]
["W40X655",29,47.5]
["W40X593",28,46.5]
["W40X503",28,45.5]
["W40X431",27,45]
["W40X397",27,44.5]
["W40X372",27,44.5]
["W40X362",27,44]
["W40X324",27,44]
["W40X297",26,43.5]
["W40X277",26,43.5]
["W40X249",26,43]
["W40X215",26,42.5]
["W40X199",26,42.5]
["W40X392",28,45.5]
["W40X331",27,44.5]
["W40X327",27,44.5]
["W40X294",27,44]
["W40X278",27,44]
["W40X264",26,43.5]
["W40X235",26,43.5]
["W40X211",26,43]
["W40X183",26,42.5]
["W40X167",26,42.5]
["W40X149",25,42]
["W36X925",29,47]
["W36X853",29,47]
["W36X802",28,46.5]
["W36X723",28,45.5]
["W36X652",27,44.5]
["W36X529",26,43.5]
["W36X487",26,43]
["W36X441",26,42.5]
["W36X395",25,42]
["W36X361",25,41.5]
["W36X330",25,41.5]
["W36X302",25,41]
["W36X282",25,41]
["W36X262",24,40.5]
["W36X247",24,40.5]
["W36X231",24,40]
["W36X256",25,41]
["W36X232",25,41]
["W36X210",24,40.5]
["W36X194",24,40]
["W36X182",24,40]
["W36X170",24,40]
["W36X160",24,39.5]
["W36X150",24,39.5]
["W36X135",24,39]
["W33X387",24,39.5]
["W33X354",24,39]
["W33X318",23,39]
["W33X291",23,38.5]
["W33X263",23,38]
["W33X241",23,38]
["W33X221",23,37.5]
["W33X201",22,37.5]
["W33X169",23,37.5]
["W33X152",22,37]
["W33X141",22,37]
["W33X130",22,37]
["W33X118",22,36.5]
["W30X391",22,37]
["W30X357",22,36.5]
["W30X326",22,36]
["W30X292",21,35.5]
["W30X261",21,35.5]
["W30X235",21,35]
["W30X211",21,34.5]
["W30X191",20,34.5]
["W30X173",20,34]
["W30X148",20,34.5]
["W30X132",20,34]
["W30X124",20,34]
["W30X116",20,33.5]
["W30X108",20,33.5]
["W30X99",20,33.5]
["W30X90",20,33]
["W27X539",22,36]
["W27X368",20,34]
["W27X336",20,33.5]
["W27X307",20,33.5]
["W27X281",20,33]
["W27X258",19,32.5]
["W27X235",19,32.5]
["W27X217",19,32]
["W27X194",19,32]
["W27X178",19,31.5]
["W27X161",18,31.5]
["W27X146",18,31]
["W27X129",18,31.5]
["W27X114",18,31]
["W27X102",18,31]
["W27X94",18,30.5]
["W27X84",18,30.5]
["W24X370",19,31.5]
["W24X335",18,31]
["W24X306",18,31]
["W24X279",18,30.5]
["W24X250",18,30]
["W24X229",17,29.5]
["W24X207",17,29.5]
["W24X192",17,29]
["W24X176",17,29]
["W24X162",17,28.5]
["W24X146",17,28.5]
["W24X131",16,28]
["W24X117",16,28]
["W24X104",16,27.5]
["W24X103",16,28]
["W24X94",16,28]
["W24X84",16,28]
["W24X76",16,27.5]
["W24X68",16,27.5]
["W24X62",16,27.5]
["W24X55",16,27.5]
["W21X275",16,28]
["W21X248",16,27.5]
["W21X223",16,27]
["W21X201",15,26.5]
["W21X182",15,26.5]
["W21X166",15,26]
["W21X147",15,25.5]
["W21X132",15,25.5]
["W21X122",15,25.5]
["W21X111",14,25]
["W21X101",14,25]
["W21X93",15,25.5]
["W21X83",14,25]
["W21X73",14,25]
["W21X68",14,25]
["W21X62",14,24.5]
["W21X55",14,24.5]
["W21X48",14,24.5]
["W21X57",14,24.5]
["W21X50",14,24.5]
["W21X44",14,24.5]
["W18X311",15,26]
["W18X283",15,25.5]
["W18X258",14,25]
["W18X234",14,24.5]
["W18X211",14,24.5]
["W18X192",14,24]
["W18X175",13,23.5]
["W18X158",13,23.5]
["W18X143",13,23]
["W18X130",13,23]
["W18X119",13,22.5]
["W18X106",13,22.5]
["W18X97",13,22.5]
["W18X86",12,22]
["W18X76",12,22]
["W18X71",13,22]
["W18X65",12,22]
["W18X60",12,22]
["W18X55",12,22]
["W18X50",12,21.5]
["W18X46",12,21.5]
["W18X40",12,21.5]
["W18X35",12,21.5]
["W16X100",12,20.5]
["W16X89",11,20.5]
["W16X77",11,20]
["W16X67",11,20]
["W16X57",11,20]
["W16X50",11,20]
["W16X45",11,20]
["W16X40",11,19.5]
["W16X36",11,19.5]
["W16X31",11,19.5]
["W16X26",11,19.5]
["W14X873",16,27.5]
["W14X808",15,26.5]
["W14X730",15,26]
["W14X665",15,25.5]
["W14X605",14,24.5]
["W14X550",14,24]
["W14X500",13,23.5]
["W14X455",13,22.5]
["W14X426",13,22.5]
["W14X398",12,22]
["W14X370",12,21.5]
["W14X342",12,21]
["W14X311",12,21]
["W14X283",11,20.5]
["W14X257",11,20]
["W14X233",11,19.5]
["W14X211",11,19.5]
["W14X193",11,19]
["W14X176",11,19]
["W14X159",11,18.5]
["W14X145",11,18.5]
["W14X132",11,18.5]
["W14X120",11,18]
["W14X109",11,18]
["W14X99",11,18]
["W14X90",11,17.5]
["W14X82",11,18]
["W14X74",11,18]
["W14X68",11,17.5]
["W14X61",11,17.5]
["W14X53",11,17.5]
["W14X48",11,17.5]
["W14X43",11,17.5]
["W14X38",11,18]
["W14X34",11,17.5]
["W14X30",11,17.5]
["W14X26",11,17.5]
["W14X22",11,17.5]
["W12X336",11,20.5]
["W12X305",11,20]
["W12X279",11,19.5]
["W12X252",11,19]
["W12X230",11,18.5]
["W12X210",11,18.5]
["W12X190",11,18]
["W12X170",11,17.5]
["W12X152",11,17.5]
["W12X136",11,17]
["W12X120",11,17]
["W12X106",11,16.5]
["W12X96",11,16.5]
["W12X87",11,16]
["W12X79",11,16]
["W12X72",11,16]
["W12X65",11,16]
["W12X58",11,16]
["W12X53",11,15.5]
["W12X50",11,16]
["W12X45",11,15.5]
["W12X40",11,15.5]
["W12X35",11,16]
["W12X30",11,16]
["W12X26",11,16]
["W12X22",11,16]
["W12X19",11,16]
["W12X16",11,15.5]
["W12X14",11,15.5]
["W10X112",11,15]
["W10X100",11,15]
["W10X88",11,14.5]
["W10X77",11,14.5]
["W10X68",11,14]
["W10X60",11,14]
["W10X54",11,14]
["W10X49",11,13.5]
["W10X45",11,14]
["W10X39",11,13.5]
["W10X33",11,13.5]
["W10X30",11,14]
["W10X26",11,14]
["W10X22",11,14]
["W10X19",11,14]
["W10X17",11,14]
["W10X15",11,13.5]
["W10X12",11,13.5]
["W8X67",11,12.5]
["W8X58",11,12.5]
["W8X48",11,12]
["W8X40",11,12]
["W8X35",11,12]
["W8X31",11,11.5]
["W8X28",11,11.5]
["W8X24",11,11.5]
["W8X21",11,12]
["W8X18",11,12]
["W8X15",11,12]
["W8X13",11,11.5]
["W8X10",11,11.5]
["HSS24X12X3/4",16,27.5]
["HSS24X12X5/8",16,27.5]
["HSS24X12X1/2",16,27.5]
["HSS22X22X7/8",15,25.5]
["HSS22X22X3/4",15,25.5]
["HSS20X20X7/8",13,23.5]
["HSS20X20X3/4",13,23.5]
["HSS20X20X5/8",13,23.5]
["HSS20X20X1/2",13,23.5]
["HSS20X12X3/4",13,23.5]
["HSS20X12X5/8",13,23.5]
["HSS20X12X1/2",13,23.5]
["HSS20X12X3/8",13,23.5]
["HSS20X12X5/16",13,23.5]
["HSS20X8X5/8",13,23.5]
["HSS20X8X1/2",13,23.5]
["HSS20X8X3/8",13,23.5]
["HSS20X8X5/16",13,23.5]
["HSS20X4X1/2",13,23.5]
["HSS20X4X3/8",13,23.5]
["HSS20X4X5/16",13,23.5]
["HSS20X4X1/4",13,23.5]
["HSS18X18X7/8",12,21.5]
["HSS18X18X3/4",12,21.5]
["HSS18X18X5/8",12,21.5]
["HSS18X18X1/2",12,21.5]
["HSS18X6X5/8",12,21.5]
["HSS18X6X1/2",12,21.5]
["HSS18X6X3/8",12,21.5]
["HSS18X6X5/16",12,21.5]
["HSS18X6X1/4",12,21.5]
["HSS16X16X7/8",11,19.5]
["HSS16X16X3/4",11,19.5]
["HSS16X16X5/8",11,19.5]
["HSS16X16X1/2",11,19.5]
["HSS16X16X3/8",11,19.5]
["HSS16X16X5/16",11,19.5]
["HSS16X12X3/4",11,19.5]
["HSS16X12X5/8",11,19.5]
["HSS16X12X1/2",11,19.5]
["HSS16X12X3/8",11,19.5]
["HSS16X12X5/16",11,19.5]
["HSS16X8X5/8",11,19.5]
["HSS16X8X1/2",11,19.5]
["HSS16X8X3/8",11,19.5]
["HSS16X8X5/16",11,19.5]
["HSS16X8X1/4",11,19.5]
["HSS16X4X5/8",11,19.5]
["HSS16X4X1/2",11,19.5]
["HSS16X4X3/8",11,19.5]
["HSS16X4X5/16",11,19.5]
["HSS16X4X1/4",11,19.5]
["HSS16X4X3/16",11,19.5]
["HSS14X14X7/8",11,17.5]
["HSS14X14X3/4",11,17.5]
["HSS14X14X5/8",11,17.5]
["HSS14X14X1/2",11,17.5]
["HSS14X14X3/8",11,17.5]
["HSS14X14X5/16",11,17.5]
["HSS14X10X5/8",11,17.5]
["HSS14X10X1/2",11,17.5]
["HSS14X10X3/8",11,17.5]
["HSS14X10X5/16",11,17.5]
["HSS14X10X1/4",11,17.5]
["HSS14X6X5/8",11,17.5]
["HSS14X6X1/2",11,17.5]
["HSS14X6X3/8",11,17.5]
["HSS14X6X5/16",11,17.5]
["HSS14X6X1/4",11,17.5]
["HSS14X6X3/16",11,17.5]
["HSS14X4X5/8",11,17.5]
["HSS14X4X1/2",11,17.5]
["HSS14X4X3/8",11,17.5]
["HSS14X4X5/16",11,17.5]
["HSS14X4X1/4",11,17.5]
["HSS14X4X3/16",11,17.5]
["HSS12X12X3/4",11,15.5]
["HSS12X12X5/8",11,15.5]
["HSS12X12X1/2",11,15.5]
["HSS12X12X3/8",11,15.5]
["HSS12X12X5/16",11,15.5]
["HSS12X12X1/4",11,15.5]
["HSS12X10X1/2",11,15.5]
["HSS12X10X3/8",11,15.5]
["HSS12X10X5/16",11,15.5]
["HSS12X10X1/4",11,15.5]
["HSS12X8X5/8",11,15.5]
["HSS12X8X1/2",11,15.5]
["HSS12X8X3/8",11,15.5]
["HSS12X8X5/16",11,15.5]
["HSS12X8X1/4",11,15.5]
["HSS12X8X3/16",11,15.5]
["HSS12X6X5/8",11,15.5]
["HSS12X6X1/2",11,15.5]
["HSS12X6X3/8",11,15.5]
["HSS12X6X5/16",11,15.5]
["HSS12X6X1/4",11,15.5]
["HSS12X6X3/16",11,15.5]
["HSS12X4X5/8",11,15.5]
["HSS12X4X1/2",11,15.5]
["HSS12X4X3/8",11,15.5]
["HSS12X4X5/16",11,15.5]
["HSS12X4X1/4",11,15.5]
["HSS12X4X3/16",11,15.5]
["HSS12X3-1/2X3/8",11,15.5]
["HSS12X3-1/2X5/16",11,15.5]
["HSS12X3X5/16",11,15.5]
["HSS12X3X1/4",11,15.5]
["HSS12X3X3/16",11,15.5]
["HSS12X2X5/16",11,15.5]
["HSS12X2X1/4",11,15.5]
["HSS12X2X3/16",11,15.5]
["HSS10X10X3/4",11,13.5]
["HSS10X10X5/8",11,13.5]
["HSS10X10X1/2",11,13.5]
["HSS10X10X3/8",11,13.5]
["HSS10X10X5/16",11,13.5]
["HSS10X10X1/4",11,13.5]
["HSS10X10X3/16",11,13.5]
["HSS10X8X5/8",11,13.5]
["HSS10X8X1/2",11,13.5]
["HSS10X8X3/8",11,13.5]
["HSS10X8X5/16",11,13.5]
["HSS10X8X1/4",11,13.5]
["HSS10X8X3/16",11,13.5]
["HSS10X6X5/8",11,13.5]
["HSS10X6X1/2",11,13.5]
["HSS10X6X3/8",11,13.5]
["HSS10X6X5/16",11,13.5]
["HSS10X6X1/4",11,13.5]
["HSS10X6X3/16",11,13.5]
["HSS10X5X3/8",11,13.5]
["HSS10X5X5/16",11,13.5]
["HSS10X5X1/4",11,13.5]
["HSS10X5X3/16",11,13.5]
["HSS10X4X5/8",11,13.5]
["HSS10X4X1/2",11,13.5]
["HSS10X4X3/8",11,13.5]
["HSS10X4X5/16",11,13.5]
["HSS10X4X1/4",11,13.5]
["HSS10X4X3/16",11,13.5]
["HSS10X4X1/8",11,13.5]
["HSS10X3-1/2X1/2",11,13.5]
["HSS10X3-1/2X3/8",11,13.5]
["HSS10X3-1/2X5/16",11,13.5]
["HSS10X3-1/2X1/4",11,13.5]
["HSS10X3-1/2X3/16",11,13.5]
["HSS10X3-1/2X1/8",11,13.5]
["HSS10X3X3/8",11,13.5]
["HSS10X3X5/16",11,13.5]
["HSS10X3X1/4",11,13.5]
["HSS10X3X3/16",11,13.5]
["HSS10X3X1/8",11,13.5]
["HSS10X2X3/8",11,13.5]
["HSS10X2X5/16",11,13.5]
["HSS10X2X1/4",11,13.5]
["HSS10X2X3/16",11,13.5]
["HSS10X2X1/8",11,13.5]
["HSS9X9X5/8",11,12.5]
["HSS9X9X1/2",11,12.5]
["HSS9X9X3/8",11,12.5]
["HSS9X9X5/16",11,12.5]
["HSS9X9X1/4",11,12.5]
["HSS9X9X3/16",11,12.5]
["HSS9X7X5/8",11,12.5]
["HSS9X7X1/2",11,12.5]
["HSS9X7X3/8",11,12.5]
["HSS9X7X5/16",11,12.5]
["HSS9X7X1/4",11,12.5]
["HSS9X7X3/16",11,12.5]
["HSS9X5X5/8",11,12.5]
["HSS9X5X1/2",11,12.5]
["HSS9X5X3/8",11,12.5]
["HSS9X5X5/16",11,12.5]
["HSS9X5X1/4",11,12.5]
["HSS9X5X3/16",11,12.5]
["HSS9X3X1/2",11,12.5]
["HSS9X3X3/8",11,12.5]
["HSS9X3X5/16",11,12.5]
["HSS9X3X1/4",11,12.5]
["HSS9X3X3/16",11,12.5]
["HSS8X8X5/8",11,11.5]
["HSS8X8X1/2",11,11.5]
["HSS8X8X3/8",11,11.5]
["HSS8X8X5/16",11,11.5]
["HSS8X8X1/4",11,11.5]
["HSS8X8X3/16",11,11.5]
["HSS8X6X5/8",11,11.5]
["HSS8X6X1/2",11,11.5]
["HSS8X6X3/8",11,11.5]
["HSS8X6X5/16",11,11.5]
["HSS8X6X1/4",11,11.5]
["HSS8X6X3/16",11,11.5]
["HSS8X4X5/8",11,11.5]
["HSS8X4X1/2",11,11.5]
["HSS8X4X3/8",11,11.5]
["HSS8X4X5/16",11,11.5]
["HSS8X4X1/4",11,11.5]
["HSS8X4X3/16",11,11.5]
["HSS8X4X1/8",11,11.5]
["HSS8X3X1/2",11,11.5]
["HSS8X3X3/8",11,11.5]
["HSS8X3X5/16",11,11.5]
["HSS8X3X1/4",11,11.5]
["HSS8X3X3/16",11,11.5]
["HSS8X3X1/8",11,11.5]
["HSS8X2X3/8",11,11.5]
["HSS8X2X5/16",11,11.5]
["HSS8X2X1/4",11,11.5]
["HSS8X2X3/16",11,11.5]
["HSS8X2X1/8",11,11.5]

{"sheet":"SP Welded","index":8,"n_rows":303,"n_cols":3,"rows_kept":303,"cut":false,"hidden":true,"merged":[]}
["Shape","SP Length (in)","SP Depth (in)"]
["W40X397",32,44]
["W40X372",32,44]
["W40X362",32,43.5]
["W40X324",31,43.5]
["W40X297",31,43]
["W40X277",31,43]
["W40X249",31,42.5]
["W40X215",31,42]
["W40X392",33,45]
["W40X331",32,44]
["W40X327",32,44]
["W40X294",32,43.5]
["W40X278",31,43.5]
["W40X264",31,43]
["W40X235",31,43]
["W40X211",31,42.5]
["W40X183",31,42]
["W40X167",30,42]
["W40X149",30,41.5]
["W36X395",30,41.5]
["W36X361",30,41]
["W36X330",29,41]
["W36X302",29,40.5]
["W36X282",29,40.5]
["W36X262",29,40]
["W36X247",29,40]
["W36X231",29,39.5]
["W36X256",29,40.5]
["W36X232",29,40.5]
["W36X210",29,40]
["W36X194",29,39.5]
["W36X182",29,39.5]
["W36X170",28,39.5]
["W36X160",28,39]
["W36X150",28,39]
["W33X387",28,39]
["W33X354",28,38.5]
["W33X318",28,38.5]
["W33X291",27,38]
["W33X263",27,37.5]
["W33X241",27,37.5]
["W33X221",27,37]
["W33X201",26,37]
["W33X169",27,37]
["W33X152",26,36.5]
["W33X141",26,36.5]
["W33X130",26,36.5]
["W30X391",26,36.5]
["W30X357",26,36]
["W30X326",25,35.5]
["W30X292",25,35]
["W30X261",25,35]
["W30X235",25,34.5]
["W30X211",24,34]
["W30X191",24,34]
["W30X173",24,33.5]
["W30X148",24,34]
["W30X132",24,33.5]
["W30X124",24,33.5]
["W30X116",24,33]
["W30X108",24,33]
["W27X368",24,33.5]
["W27X336",24,33]
["W27X307",23,33]
["W27X281",23,32.5]
["W27X258",23,32]
["W27X235",23,32]
["W27X217",22,31.5]
["W27X194",22,31.5]
["W27X178",22,31]
["W27X161",22,31]
["W27X146",22,30.5]
["W27X129",22,31]
["W27X114",21,30.5]
["W27X102",21,30.5]
["W27X94",21,30]
["W24X370",22,31]
["W24X335",22,30.5]
["W24X306",21,30.5]
["W24X279",21,30]
["W24X250",21,29.5]
["W24X229",21,29]
["W24X207",20,29]
["W24X192",20,28.5]
["W24X176",20,28.5]
["W24X162",20,28]
["W24X146",20,28]
["W24X131",19,27.5]
["W24X103",19,27.5]
["W24X94",19,27.5]
["W24X84",19,27.5]
["W24X76",19,27]
["W24X62",19,27]
["W24X55",19,27]
["W21X201",18,26]
["W21X182",18,26]
["W21X166",18,25.5]
["W21X147",17,25]
["W21X132",17,25]
["W21X122",17,25]
["W21X111",17,24.5]
["W21X93",17,25]
["W21X83",17,24.5]
["W21X73",17,24.5]
["W21X68",17,24.5]
["W21X62",17,24]
["W21X57",17,24]
["W21X50",17,24]
["W21X44",16,24]
["W18X311",16,25.5]
["W18X283",16,25]
["W18X258",16,24.5]
["W18X234",16,24]
["W18X211",16,24]
["W18X192",16,23.5]
["W18X175",16,23]
["W18X158",16,23]
["W18X143",16,22.5]
["W18X130",16,22.5]
["W18X119",16,22]
["W18X106",16,22]
["W18X97",16,22]
["W18X86",16,21.5]
["W18X71",16,21.5]
["W18X65",16,21.5]
["W18X60",16,21.5]
["W18X55",16,21.5]
["W18X50",16,21]
["W18X46",16,21]
["W18X40",16,21]
["W18X35",16,21]
["W16X100",17,20]
["W16X89",17,20]
["W16X77",17,19.5]
["W16X57",17,19.5]
["W16X50",17,19.5]
["W16X45",17,19.5]
["W16X40",16,19]
["W16X31",16,19]
["W14X398",19,21.5]
["W14X370",18,21]
["W14X342",18,20.5]
["W14X311",18,20.5]
["W14X283",17,20]
["W14X257",17,19.5]
["W14X233",16,19]
["W14X211",16,19]
["W14X193",16,18.5]
["W14X176",16,18.5]
["W14X159",15,18]
["W14X145",15,18]
["W14X132",15,18]
["W14X82",15,17.5]
["W14X74",15,17.5]
["W14X68",14,17]
["W14X53",14,17]
["W14X48",14,17]
["W14X38",15,17.5]
["W14X26",14,17]
["W12X336",17,20]
["W12X305",17,19.5]
["W12X279",16,19]
["W12X252",16,18.5]
["W12X230",15,18]
["W12X210",15,18]
["W12X190",15,17.5]
["W12X170",14,17]
["W12X152",14,17]
["W12X136",14,16.5]
["W12X120",14,16.5]
["W12X106",13,16]
["W12X96",13,16]
["W12X50",13,15.5]
["W12X45",12,15]
["W12X35",13,15.5]
["W12X22",13,15.5]
["W12X19",13,15.5]
["W10x112",12,14.5]
["W10x100",12,14.5]
["W10x88",11,14]
["W10x77",11,14]
["W10x68",11,13.5]
["W10x45",11,13.5]
["W10x30",11,13.5]
["W10x26",11,13.5]
["W10x19",11,13.5]
["W10x17",11,13.5]
["W8x67",9,12]
["W8x58",9,12]
["W8x48",9,11.5]
["W8x40",9,11.5]
["W8x28",8,11]
["W8x21",9,11.5]
["W8x15",9,11.5]
["HSS24X12X3/4",19,27]
["HSS22X22X7/8",17,25]
["HSS22X22X3/4",17,25]
["HSS20X20X7/8",16,23]
["HSS20X20X3/4",16,23]
["HSS20X12X3/4",16,23]
["HSS20X12X5/8",16,23]
["HSS20X8X5/8",16,23]
["HSS18X18X7/8",16,21]
["HSS18X18X3/4",16,21]
["HSS18X18X5/8",16,21]
["HSS18X6X5/8",16,21]
["HSS16X16X7/8",16,19]
["HSS16X16X3/4",16,19]
["HSS16X16X5/8",16,19]
["HSS16X12X3/4",16,19]
["HSS16X12X5/8",16,19]
["HSS16X12X1/2",16,19]
["HSS16X8X5/8",16,19]
["HSS16X8X1/2",16,19]
["HSS16X4X5/8",16,19]
["HSS16X4X1/2",16,19]
["HSS14X14X7/8",14,17]
["HSS14X14X3/4",14,17]
["HSS14X14X5/8",14,17]
["HSS14X14X1/2",14,17]
["HSS14X10X5/8",14,17]
["HSS14X10X1/2",14,17]
["HSS14X6X5/8",14,17]
["HSS14X6X1/2",14,17]
["HSS14X4X5/8",14,17]
["HSS14X4X1/2",14,17]
["HSS12X12X3/4",12,15]
["HSS12X12X5/8",12,15]
["HSS12X12X1/2",12,15]
["HSS12X10X1/2",12,15]
["HSS12X10X3/8",12,15]
["HSS12X8X5/8",12,15]
["HSS12X8X1/2",12,15]
["HSS12X8X3/8",12,15]
["HSS12X6X5/8",12,15]
["HSS12X6X1/2",12,15]
["HSS12X6X3/8",12,15]
["HSS12X4X5/8",12,15]
["HSS12X4X1/2",12,15]
["HSS12X4X3/8",12,15]
["HSS12X3-1/2X3/8",12,15]
["HSS10X10X3/4",10,13]
["HSS10X10X5/8",10,13]
["HSS10X10X1/2",10,13]
["HSS10X10X3/8",10,13]
["HSS10X8X5/8",10,13]
["HSS10X8X1/2",10,13]
["HSS10X8X3/8",10,13]
["HSS10X8X5/16",10,13]
["HSS10X6X5/8",10,13]
["HSS10X6X1/2",10,13]
["HSS10X6X3/8",10,13]
["HSS10X6X5/16",10,13]
["HSS10X5X3/8",10,13]
["HSS10X5X5/16",10,13]
["HSS10X4X5/8",10,13]
["HSS10X4X1/2",10,13]
["HSS10X4X3/8",10,13]
["HSS10X4X5/16",10,13]
["HSS10X3-1/2X1/2",10,13]
["HSS10X3-1/2X3/8",10,13]
["HSS10X3-1/2X5/16",10,13]
["HSS10X3X3/8",10,13]
["HSS10X3X5/16",10,13]
["HSS10X2X3/8",10,13]
["HSS10X2X5/16",10,13]
["HSS9X9X5/8",9,12]
["HSS9X9X1/2",9,12]
["HSS9X9X3/8",9,12]
["HSS9X9X5/16",9,12]
["HSS9X7X5/8",9,12]
["HSS9X7X1/2",9,12]
["HSS9X7X3/8",9,12]
["HSS9X7X5/16",9,12]
["HSS9X5X5/8",9,12]
["HSS9X5X1/2",9,12]
["HSS9X5X3/8",9,12]
["HSS9X5X5/16",9,12]
["HSS9X3X1/2",9,12]
["HSS9X3X3/8",9,12]
["HSS9X3X5/16",9,12]
["HSS8X8X5/8",8,11]
["HSS8X8X1/2",8,11]
["HSS8X8X3/8",8,11]
["HSS8X8X5/16",8,11]
["HSS8X6X5/8",8,11]
["HSS8X6X1/2",8,11]
["HSS8X6X3/8",8,11]
["HSS8X6X5/16",8,11]
["HSS8X6X1/4",8,11]
["HSS8X4X5/8",8,11]
["HSS8X4X1/2",8,11]
["HSS8X4X3/8",8,11]
["HSS8X4X5/16",8,11]
["HSS8X4X1/4",8,11]
["HSS8X3X1/2",8,11]
["HSS8X3X3/8",8,11]
["HSS8X3X5/16",8,11]
["HSS8X3X1/4",8,11]
["HSS8X2X3/8",8,11]
["HSS8X2X5/16",8,11]
["HSS8X2X1/4",8,11]